Test_openjdk11_hs_extended.openjdk_aarch64_mac
Started by upstream project "build-scripts/jobs/jdk11u/jdk11u-mac-aarch64-temurin" build number 371
originally caused by:
Started by upstream project "build-scripts/openjdk11-pipeline" build number 2749
originally caused by:
Started by upstream project "build-scripts/utils/betaTrigger_11ea" build number 229
originally caused by:
Started by timer
Checking out git ${ADOPTOPENJDK_REPO} into /home/jenkins/.jenkins/workspace/Test_openjdk11_hs_extended.openjdk_aarch64_mac@script/7d272c0688f17ab4e5b2f6ce77a7dc9cf4df33ff05c3a95eddd38682ef795b79 to read aqa-tests/buildenv/jenkins/openjdk_tests
The recommended git tool is: git
No credentials specified
Wiping out workspace first.
Cloning the remote Git repository
Using shallow clone with depth 1
Cloning repository https://github.com/adoptium/aqa-tests.git
> git init /home/jenkins/.jenkins/workspace/Test_openjdk11_hs_extended.openjdk_aarch64_mac@script/7d272c0688f17ab4e5b2f6ce77a7dc9cf4df33ff05c3a95eddd38682ef795b79/aqa-tests # timeout=10
Fetching upstream changes from https://github.com/adoptium/aqa-tests.git
> git --version # timeout=10
> git --version # 'git version 2.43.0'
> git fetch --tags --force --progress --depth=1 -- https://github.com/adoptium/aqa-tests.git +refs/heads/*:refs/remotes/origin/* # timeout=60
> git config remote.origin.url https://github.com/adoptium/aqa-tests.git # timeout=10
> git config --add remote.origin.fetch +refs/heads/*:refs/remotes/origin/* # timeout=10
Avoid second fetch
> git rev-parse origin/master^{commit} # timeout=10
Checking out Revision a90cb73d942dbfbbe14ea1f5bb120ee4e24b4a69 (origin/master)
> git config core.sparsecheckout # timeout=10
> git checkout -f a90cb73d942dbfbbe14ea1f5bb120ee4e24b4a69 # timeout=10
Commit message: "Setting upstream job status to the worst status of downstream jobs (#5969)"
> git rev-list --no-walk 3208a395941bca5856b37977b067205f1da990ab # timeout=10
First time build. Skipping changelog.
[Pipeline] Start of Pipeline
[Pipeline] timestamps
[Pipeline] {
[Pipeline] echo
[2025-03-05T21:47:05.617Z] SPEC: osx_aarch64
[Pipeline] echo
[2025-03-05T21:47:05.619Z] LABEL: ci.role.test&&hw.arch.aarch64&&(sw.os.osx||sw.os.mac)
[Pipeline] stage
[Pipeline] { (Queue)
[Pipeline] nodesByLabel
[2025-03-05T21:47:05.634Z] Could not find any nodes with 'ci.role.test&&hw.arch.aarch64&&(sw.os.osx||sw.os.mac)' label
[Pipeline] timeout
[2025-03-05T21:47:05.641Z] Timeout set to expire in 5 min 0 sec
[Pipeline] {
[Pipeline] node
[2025-03-05T21:47:20.651Z] Still waiting to schedule task
[2025-03-05T21:47:20.653Z] All nodes of label ‘ci.role.test&&hw.arch.aarch64&&(sw.os.osx||sw.os.mac)’ are offline
[2025-03-05T21:47:30.409Z] Running on test-orka-macos14-arm64-f7v64 in /Users/admin/workspace/workspace/Test_openjdk11_hs_extended.openjdk_aarch64_mac
[Pipeline] {
[Pipeline] echo
[2025-03-05T21:47:30.428Z] find the node with label as test-orka-macos14-arm64-f7v64
[Pipeline] }
[Pipeline] // node
[Pipeline] }
[Pipeline] // timeout
[Pipeline] node
[2025-03-05T21:47:30.592Z] Running on test-orka-macos14-arm64-f7v64 in /Users/admin/workspace/workspace/Test_openjdk11_hs_extended.openjdk_aarch64_mac
[Pipeline] {
[Pipeline] retry
[Pipeline] {
[Pipeline] timeout
[2025-03-05T21:47:30.610Z] Timeout set to expire in 1 hr 0 min
[Pipeline] {
[Pipeline] cleanWs
[2025-03-05T21:47:31.156Z] [WS-CLEANUP] Deleting project workspace...
[2025-03-05T21:47:31.156Z] [WS-CLEANUP] Deferred wipeout is disabled by the job configuration...
[2025-03-05T21:47:33.581Z] [WS-CLEANUP] done
[Pipeline] }
[Pipeline] // timeout
[Pipeline] checkout
[2025-03-05T21:47:33.642Z] The recommended git tool is: /opt/homebrew/bin/git
[2025-03-05T21:47:43.619Z] No credentials specified
[2025-03-05T21:47:43.656Z] Cloning the remote Git repository
[2025-03-05T21:47:43.741Z] Cloning repository https://github.com/adoptium/aqa-tests.git
[2025-03-05T21:47:43.846Z] > /opt/homebrew/bin/git init /Users/admin/workspace/workspace/Test_openjdk11_hs_extended.openjdk_aarch64_mac/aqa-tests # timeout=10
[2025-03-05T21:47:44.031Z] [WARNING] Reference path does not exist: /Users/admin/openjdk_cache
[2025-03-05T21:47:44.068Z] Fetching upstream changes from https://github.com/adoptium/aqa-tests.git
[2025-03-05T21:47:44.068Z] > /opt/homebrew/bin/git --version # timeout=10
[2025-03-05T21:47:44.080Z] > git --version # 'git version 2.45.2'
[2025-03-05T21:47:44.080Z] > /opt/homebrew/bin/git fetch --tags --force --progress -- https://github.com/adoptium/aqa-tests.git +refs/heads/*:refs/remotes/origin/* # timeout=10
[2025-03-05T21:47:52.115Z] > /opt/homebrew/bin/git config remote.origin.url https://github.com/adoptium/aqa-tests.git # timeout=10
[2025-03-05T21:47:52.123Z] > /opt/homebrew/bin/git config --add remote.origin.fetch +refs/heads/*:refs/remotes/origin/* # timeout=10
[2025-03-05T21:48:12.984Z] Avoid second fetch
[2025-03-05T21:48:13.059Z] Checking out Revision a90cb73d942dbfbbe14ea1f5bb120ee4e24b4a69 (origin/master)
[2025-03-05T21:48:15.345Z] Commit message: "Setting upstream job status to the worst status of downstream jobs (#5969)"
[Pipeline] }
[Pipeline] // retry
[Pipeline] load
[2025-03-05T21:48:12.976Z] > /opt/homebrew/bin/git rev-parse origin/master^{commit} # timeout=10
[2025-03-05T21:48:13.090Z] > /opt/homebrew/bin/git config core.sparsecheckout # timeout=10
[2025-03-05T21:48:13.104Z] > /opt/homebrew/bin/git checkout -f a90cb73d942dbfbbe14ea1f5bb120ee4e24b4a69 # timeout=10
[Pipeline] { (/Users/admin/workspace/workspace/Test_openjdk11_hs_extended.openjdk_aarch64_mac/aqa-tests/buildenv/jenkins/JenkinsfileBase)
[Pipeline] }
[Pipeline] // load
[Pipeline] timeout
[2025-03-05T21:48:16.884Z] Timeout set to expire in 1 day 1 hr
[Pipeline] {
[Pipeline] stage
[Pipeline] { (Setup)
[Pipeline] sh
[2025-03-05T21:48:18.073Z] + LC_TIME=C
[2025-03-05T21:48:18.073Z] + date '+%a, %d %b %Y %T %z'
[Pipeline] echo
[2025-03-05T21:48:18.374Z] PROCESSCATCH: Terminating any hung/left over test processes:
[Pipeline] sh
[2025-03-05T21:48:18.951Z] + aqa-tests/terminateTestProcesses.sh admin
[2025-03-05T21:48:18.951Z] Mac type machine.. do not terminate any remaining processes as Orka mac VMs are not process isolated, see: https://github.com/adoptium/aqa-tests/issues/4964
[Pipeline] sh
[2025-03-05T21:48:20.394Z] + printenv
[2025-03-05T21:48:20.394Z] JCK_GIT_BRANCH=master
[2025-03-05T21:48:20.394Z] DYNAMIC_COMPILE=false
[2025-03-05T21:48:20.394Z] JENKINS_NODE_COOKIE=8da06995-efe6-4808-b2e6-79b141231e35
[2025-03-05T21:48:20.394Z] OPENJ9_BRANCH=master
[2025-03-05T21:48:20.394Z] BUILD_URL=https://ci.adoptium.net/job/Test_openjdk11_hs_extended.openjdk_aarch64_mac/137/
[2025-03-05T21:48:20.394Z] DOCKER_REQUIRED=false
[2025-03-05T21:48:20.394Z] PARALLEL=Dynamic
[2025-03-05T21:48:20.394Z] SHELL=/bin/zsh
[2025-03-05T21:48:20.394Z] HUDSON_SERVER_COOKIE=2d832652af5afba8
[2025-03-05T21:48:20.394Z] JOBSTARTTIME=Wed, 05 Mar 2025 16:48:17 -0500
[2025-03-05T21:48:20.394Z] STAGE_NAME=Setup
[2025-03-05T21:48:20.394Z] SSH_CLIENT=78.47.239.97 56446 22
[2025-03-05T21:48:20.394Z] TMPDIR=/var/folders/fs/0w3t9t1d28xc3bj0tgb8hcrw0000gn/T/
[2025-03-05T21:48:20.394Z] RERUN_FAILURE=true
[2025-03-05T21:48:20.394Z] BUILD_TAG=jenkins-Test_openjdk11_hs_extended.openjdk_aarch64_mac-137
[2025-03-05T21:48:20.394Z] SDK_RESOURCE=upstream
[2025-03-05T21:48:20.394Z] TIME_LIMIT=25
[2025-03-05T21:48:20.394Z] EXTERNAL_TEST_CMD=mvn clean install
[2025-03-05T21:48:20.394Z] OPENJ9_REPO=https://github.com/eclipse-openj9/openj9.git
[2025-03-05T21:48:20.394Z] WORKSPACE=/Users/admin/workspace/workspace/Test_openjdk11_hs_extended.openjdk_aarch64_mac
[2025-03-05T21:48:20.394Z] JOB_URL=https://ci.adoptium.net/job/Test_openjdk11_hs_extended.openjdk_aarch64_mac/
[2025-03-05T21:48:20.394Z] RUN_CHANGES_DISPLAY_URL=https://ci.adoptium.net/job/Test_openjdk11_hs_extended.openjdk_aarch64_mac/137/display/redirect?page=changes
[2025-03-05T21:48:20.394Z] JDK_BRANCH=jdk-11.0.27+4_adopt
[2025-03-05T21:48:20.394Z] ACTIVE_NODE_TIMEOUT=5
[2025-03-05T21:48:20.394Z] USER=admin
[2025-03-05T21:48:20.394Z] ADOPTOPENJDK_BRANCH=master
[2025-03-05T21:48:20.394Z] OPENJCEPLUS_GIT_BRANCH=semeru-java11
[2025-03-05T21:48:20.394Z] ARCHIVE_TEST_RESULTS=false
[2025-03-05T21:48:20.394Z] UPSTREAM_JOB_NAME=build-scripts/jobs/jdk11u/jdk11u-mac-aarch64-temurin
[2025-03-05T21:48:20.394Z] STF_OWNER_BRANCH=adoptium:master
[2025-03-05T21:48:20.394Z] LIGHT_WEIGHT_CHECKOUT=false
[2025-03-05T21:48:20.394Z] RUN_ARTIFACTS_DISPLAY_URL=https://ci.adoptium.net/job/Test_openjdk11_hs_extended.openjdk_aarch64_mac/137/display/redirect?page=artifacts
[2025-03-05T21:48:20.394Z] __CF_USER_TEXT_ENCODING=0x1F5:0x0:0x0
[2025-03-05T21:48:20.394Z] ORIGIN_JDK_VERSION=11
[2025-03-05T21:48:20.394Z] SETUP_JCK_RUN=false
[2025-03-05T21:48:20.394Z] PERSONAL_BUILD=false
[2025-03-05T21:48:20.394Z] TKG_OWNER_BRANCH=adoptium:master
[2025-03-05T21:48:20.394Z] RERUN_ITERATIONS=1
[2025-03-05T21:48:20.394Z] SPEC=osx_aarch64
[2025-03-05T21:48:20.394Z] TKG_ITERATIONS=1
[2025-03-05T21:48:20.394Z] JENKINS_HOME=/home/jenkins/.jenkins
[2025-03-05T21:48:20.394Z] ITERATIONS=1
[2025-03-05T21:48:20.394Z] PATH=/opt/homebrew/bin:/usr/local/bin/:/usr/bin:/bin:/usr/sbin:/sbin
[2025-03-05T21:48:20.394Z] LIB_DIR=/Users/admin/workspace/workspace/Test_openjdk11_hs_extended.openjdk_aarch64_mac/../../testDependency/lib
[2025-03-05T21:48:20.394Z] KEEP_REPORTDIR=true
[2025-03-05T21:48:20.394Z] RUN_DISPLAY_URL=https://ci.adoptium.net/job/Test_openjdk11_hs_extended.openjdk_aarch64_mac/137/display/redirect
[2025-03-05T21:48:20.394Z] _=/usr/bin/printenv
[2025-03-05T21:48:20.394Z] GENERATE_JOBS=true
[2025-03-05T21:48:20.394Z] PWD=/Users/admin/workspace/workspace/Test_openjdk11_hs_extended.openjdk_aarch64_mac
[2025-03-05T21:48:20.394Z] JAVA_HOME=/Library/Java/JavaVirtualMachines/jdk-17/Contents/Home
[2025-03-05T21:48:20.394Z] EXIT_FAILURE=false
[2025-03-05T21:48:20.394Z] HUDSON_URL=https://ci.adoptium.net/
[2025-03-05T21:48:20.394Z] JDK_VERSION=11
[2025-03-05T21:48:20.394Z] CUSTOMIZED_SDK_URL_CREDENTIAL_ID=eclipse_temurin_bot_email_and_token
[2025-03-05T21:48:20.394Z] OPENJ9_SYSTEMTEST_OWNER_BRANCH=eclipse:master
[2025-03-05T21:48:20.394Z] SLACK_CHANNEL=aqavit-bot
[2025-03-05T21:48:20.394Z] JOB_NAME=Test_openjdk11_hs_extended.openjdk_aarch64_mac
[2025-03-05T21:48:20.394Z] BUILD_DISPLAY_NAME=#137
[2025-03-05T21:48:20.394Z] USE_TESTENV_PROPERTIES=false
[2025-03-05T21:48:20.394Z] JENKINS_URL=https://ci.adoptium.net/
[2025-03-05T21:48:20.394Z] EXIT_SUCCESS=false
[2025-03-05T21:48:20.394Z] BUILD_ID=137
[2025-03-05T21:48:20.394Z] TEST_TIME=120
[2025-03-05T21:48:20.394Z] PLATFORM=aarch64_mac
[2025-03-05T21:48:20.394Z] JDK_IMPL=hotspot
[2025-03-05T21:48:20.394Z] JOB_BASE_NAME=Test_openjdk11_hs_extended.openjdk_aarch64_mac
[2025-03-05T21:48:20.394Z] RUN_TESTS_DISPLAY_URL=https://ci.adoptium.net/job/Test_openjdk11_hs_extended.openjdk_aarch64_mac/137/display/redirect?page=tests
[2025-03-05T21:48:20.394Z] SHLVL=2
[2025-03-05T21:48:20.394Z] AUTO_DETECT=true
[2025-03-05T21:48:20.394Z] HOME=/Users/admin
[2025-03-05T21:48:20.394Z] TAP_NAME=Test_openjdk11_hs_extended.openjdk_aarch64_mac.tap
[2025-03-05T21:48:20.394Z] CI=true
[2025-03-05T21:48:20.394Z] WORKSPACE_TMP=/Users/admin/workspace/workspace/Test_openjdk11_hs_extended.openjdk_aarch64_mac@tmp
[2025-03-05T21:48:20.394Z] EXECUTOR_NUMBER=0
[2025-03-05T21:48:20.394Z] JENKINS_SERVER_COOKIE=durable-90159861728f92803e132b777bb54c8c96d0572d85990e327d1ccee0ccb58fda
[2025-03-05T21:48:20.394Z] NODE_LABELS=test-orka-macos14-arm64-f7v64 aarch64 macos14 hw.arch.aarch64 ci.role.test arm64 sw.os.osx orka mac
[2025-03-05T21:48:20.394Z] SYSTEM_LIB_DIR=/Users/admin/workspace/workspace/Test_openjdk11_hs_extended.openjdk_aarch64_mac/../../testDependency/system_lib
[2025-03-05T21:48:20.394Z] BUILD_LIST=openjdk
[2025-03-05T21:48:20.394Z] TARGET=extended.openjdk
[2025-03-05T21:48:20.394Z] LOGNAME=admin
[2025-03-05T21:48:20.394Z] EXTERNAL_CUSTOM_BRANCH=master
[2025-03-05T21:48:20.394Z] JDK_REPO=https://github.com/adoptium/jdk11u
[2025-03-05T21:48:20.394Z] ADOPTOPENJDK_SYSTEMTEST_OWNER_BRANCH=adoptium:master
[2025-03-05T21:48:20.394Z] JAVA_MAIN_CLASS_408=hudson.remoting.Launcher
[2025-03-05T21:48:20.394Z] HUDSON_HOME=/home/jenkins/.jenkins
[2025-03-05T21:48:20.394Z] SSH_CONNECTION=78.47.239.97 56446 192.168.64.7 22
[2025-03-05T21:48:20.394Z] UPSTREAM_JOB_NUMBER=371
[2025-03-05T21:48:20.394Z] NODE_NAME=test-orka-macos14-arm64-f7v64
[2025-03-05T21:48:20.394Z] BUILD_NUMBER=137
[2025-03-05T21:48:20.394Z] JOB_DISPLAY_URL=https://ci.adoptium.net/job/Test_openjdk11_hs_extended.openjdk_aarch64_mac/display/redirect
[2025-03-05T21:48:20.394Z] KEEP_WORKSPACE=false
[2025-03-05T21:48:20.394Z] HUDSON_COOKIE=500eaa91-8eb4-46be-838f-a3f09b60f602
[2025-03-05T21:48:20.394Z] PERF_ROOT=/Users/admin/workspace/workspace/Test_openjdk11_hs_extended.openjdk_aarch64_mac/../../benchmarks
[2025-03-05T21:48:20.394Z] USE_JRE=false
[2025-03-05T21:48:20.394Z] TEST_JDK_HOME=/Users/admin/workspace/workspace/Test_openjdk11_hs_extended.openjdk_aarch64_mac/jdkbinary/j2sdk-image
[2025-03-05T21:48:20.394Z] ADOPTOPENJDK_REPO=https://github.com/adoptium/aqa-tests.git
[2025-03-05T21:48:20.394Z] OPENJCEPLUS_GIT_REPO=https://github.com/ibmruntimes/OpenJCEPlus.git
[Pipeline] timeout
[2025-03-05T21:48:20.519Z] Timeout set to expire in 1 hr 0 min
[Pipeline] {
[Pipeline] dir
[2025-03-05T21:48:20.547Z] Running in /Users/admin/workspace/workspace/Test_openjdk11_hs_extended.openjdk_aarch64_mac/jdkbinary
[Pipeline] {
[Pipeline] copyArtifacts
[2025-03-05T21:48:37.583Z] Copied 7 artifacts from "build-scripts » jobs » jdk11u » jdk11u-mac-aarch64-temurin" build number 371
[Pipeline] }
[Pipeline] // dir
[Pipeline] }
[Pipeline] // timeout
[Pipeline] echo
[2025-03-05T21:48:38.020Z] IS_SVT_TESTREPO is set to false
[Pipeline] dir
[2025-03-05T21:48:38.042Z] Running in /Users/admin/workspace/workspace/Test_openjdk11_hs_extended.openjdk_aarch64_mac
[Pipeline] {
[Pipeline] sshagent
[2025-03-05T21:48:38.076Z] $ ssh-agent
[2025-03-05T21:48:38.296Z] SSH_AUTH_SOCK=/var/folders/fs/0w3t9t1d28xc3bj0tgb8hcrw0000gn/T//ssh-iGBKR3dQgl7F/agent.654
[2025-03-05T21:48:38.296Z] SSH_AGENT_PID=655
[2025-03-05T21:48:38.296Z] [ssh-agent] Started.
[Pipeline] {
[Pipeline] dir
[2025-03-05T21:48:38.316Z] Running in /Users/admin/workspace/workspace/Test_openjdk11_hs_extended.openjdk_aarch64_mac/aqa-tests
[Pipeline] {
[Pipeline] withCredentials
[2025-03-05T21:48:38.356Z] Masking supported pattern matches of $USERNAME or $PASSWORD
[Pipeline] {
[Pipeline] sh
[2025-03-05T21:48:41.348Z] ++ pwd
[2025-03-05T21:48:41.349Z] + ./get.sh -s /Users/admin/workspace/workspace/Test_openjdk11_hs_extended.openjdk_aarch64_mac/aqa-tests/.. -p aarch64_mac -r upstream -j 11 -i hotspot --clone_openj9 false --tkg_repo https://github.com/adoptium/TKG.git --tkg_branch master
[2025-03-05T21:48:41.349Z] TESTDIR: /Users/admin/workspace/workspace/Test_openjdk11_hs_extended.openjdk_aarch64_mac/aqa-tests
[2025-03-05T21:48:41.349Z] get jdk binary...
[2025-03-05T21:48:41.349Z] --sdkdir is set to upstream. Therefore, skip download jdk binary
[2025-03-05T21:48:41.349Z] Uncompressing file: OpenJDK11U-jdk_aarch64_mac_hotspot_11.0.27_4-ea.tar.gz ...
[2025-03-05T21:48:42.187Z] List files in jdkbinary folder...
[2025-03-05T21:48:42.187Z] total 580792
[2025-03-05T21:48:42.187Z] -rw-r--r-- 1 admin staff 36956091 Mar 5 16:18 OpenJDK11U-debugimage_aarch64_mac_hotspot_11.0.27_4-ea.tar.gz
[2025-03-05T21:48:42.187Z] -rw-r--r-- 1 admin staff 185093365 Mar 5 16:22 OpenJDK11U-jdk_aarch64_mac_hotspot_11.0.27_4-ea.tar.gz
[2025-03-05T21:48:42.187Z] -rw-r--r-- 1 admin staff 38119461 Mar 5 16:22 OpenJDK11U-jre_aarch64_mac_hotspot_11.0.27_4-ea.tar.gz
[2025-03-05T21:48:42.187Z] -rw-r--r-- 1 admin staff 26146 Mar 5 16:19 OpenJDK11U-sbom_aarch64_mac_hotspot_11.0.27_4-ea-metadata.json
[2025-03-05T21:48:42.187Z] -rw-r--r-- 1 admin staff 137517 Mar 5 16:38 OpenJDK11U-sbom_aarch64_mac_hotspot_11.0.27_4-ea.json
[2025-03-05T21:48:42.187Z] -rw-r--r-- 1 admin staff 3847108 Mar 5 16:22 OpenJDK11U-static-libs_aarch64_mac_hotspot_11.0.27_4-ea.tar.gz
[2025-03-05T21:48:42.187Z] -rw-r--r-- 1 admin staff 31039488 Mar 5 16:18 OpenJDK11U-testimage_aarch64_mac_hotspot_11.0.27_4-ea.tar.gz
[2025-03-05T21:48:42.187Z] drwxr-xr-x 3 admin staff 96 Mar 5 16:48 tmp
[2025-03-05T21:48:42.187Z] List files in jdkbinary/tmp folder...
[2025-03-05T21:48:42.187Z] total 0
[2025-03-05T21:48:42.187Z] drwxr-xr-x 3 admin staff 96 Mar 5 08:21 jdk-11.0.27+4
[2025-03-05T21:48:42.187Z] Moving directory jdk-11.0.27+4/ to ../j2sdk-image
[2025-03-05T21:48:42.187Z] Uncompressing file: OpenJDK11U-jre_aarch64_mac_hotspot_11.0.27_4-ea.tar.gz ...
[2025-03-05T21:48:42.580Z] List files in jdkbinary folder...
[2025-03-05T21:48:42.580Z] total 580792
[2025-03-05T21:48:42.580Z] -rw-r--r-- 1 admin staff 36956091 Mar 5 16:18 OpenJDK11U-debugimage_aarch64_mac_hotspot_11.0.27_4-ea.tar.gz
[2025-03-05T21:48:42.580Z] -rw-r--r-- 1 admin staff 185093365 Mar 5 16:22 OpenJDK11U-jdk_aarch64_mac_hotspot_11.0.27_4-ea.tar.gz
[2025-03-05T21:48:42.580Z] -rw-r--r-- 1 admin staff 38119461 Mar 5 16:22 OpenJDK11U-jre_aarch64_mac_hotspot_11.0.27_4-ea.tar.gz
[2025-03-05T21:48:42.580Z] -rw-r--r-- 1 admin staff 26146 Mar 5 16:19 OpenJDK11U-sbom_aarch64_mac_hotspot_11.0.27_4-ea-metadata.json
[2025-03-05T21:48:42.580Z] -rw-r--r-- 1 admin staff 137517 Mar 5 16:38 OpenJDK11U-sbom_aarch64_mac_hotspot_11.0.27_4-ea.json
[2025-03-05T21:48:42.580Z] -rw-r--r-- 1 admin staff 3847108 Mar 5 16:22 OpenJDK11U-static-libs_aarch64_mac_hotspot_11.0.27_4-ea.tar.gz
[2025-03-05T21:48:42.580Z] -rw-r--r-- 1 admin staff 31039488 Mar 5 16:18 OpenJDK11U-testimage_aarch64_mac_hotspot_11.0.27_4-ea.tar.gz
[2025-03-05T21:48:42.580Z] drwxr-xr-x 3 admin staff 96 Mar 5 08:21 j2sdk-image
[2025-03-05T21:48:42.580Z] drwxr-xr-x 3 admin staff 96 Mar 5 16:48 tmp
[2025-03-05T21:48:42.580Z] List files in jdkbinary/tmp folder...
[2025-03-05T21:48:42.580Z] total 0
[2025-03-05T21:48:42.580Z] drwxr-xr-x 3 admin staff 96 Mar 5 08:22 jdk-11.0.27+4-jre
[2025-03-05T21:48:42.580Z] Moving directory jdk-11.0.27+4-jre/ to ../j2re-image
[2025-03-05T21:48:42.580Z] Uncompressing file: OpenJDK11U-static-libs_aarch64_mac_hotspot_11.0.27_4-ea.tar.gz ...
[2025-03-05T21:48:42.581Z] List files in jdkbinary folder...
[2025-03-05T21:48:42.581Z] total 580792
[2025-03-05T21:48:42.581Z] -rw-r--r-- 1 admin staff 36956091 Mar 5 16:18 OpenJDK11U-debugimage_aarch64_mac_hotspot_11.0.27_4-ea.tar.gz
[2025-03-05T21:48:42.581Z] -rw-r--r-- 1 admin staff 185093365 Mar 5 16:22 OpenJDK11U-jdk_aarch64_mac_hotspot_11.0.27_4-ea.tar.gz
[2025-03-05T21:48:42.581Z] -rw-r--r-- 1 admin staff 38119461 Mar 5 16:22 OpenJDK11U-jre_aarch64_mac_hotspot_11.0.27_4-ea.tar.gz
[2025-03-05T21:48:42.581Z] -rw-r--r-- 1 admin staff 26146 Mar 5 16:19 OpenJDK11U-sbom_aarch64_mac_hotspot_11.0.27_4-ea-metadata.json
[2025-03-05T21:48:42.581Z] -rw-r--r-- 1 admin staff 137517 Mar 5 16:38 OpenJDK11U-sbom_aarch64_mac_hotspot_11.0.27_4-ea.json
[2025-03-05T21:48:42.581Z] -rw-r--r-- 1 admin staff 3847108 Mar 5 16:22 OpenJDK11U-static-libs_aarch64_mac_hotspot_11.0.27_4-ea.tar.gz
[2025-03-05T21:48:42.581Z] -rw-r--r-- 1 admin staff 31039488 Mar 5 16:18 OpenJDK11U-testimage_aarch64_mac_hotspot_11.0.27_4-ea.tar.gz
[2025-03-05T21:48:42.581Z] drwxr-xr-x 3 admin staff 96 Mar 5 08:22 j2re-image
[2025-03-05T21:48:42.581Z] drwxr-xr-x 3 admin staff 96 Mar 5 08:21 j2sdk-image
[2025-03-05T21:48:42.581Z] drwxr-xr-x 3 admin staff 96 Mar 5 16:48 tmp
[2025-03-05T21:48:42.581Z] List files in jdkbinary/tmp folder...
[2025-03-05T21:48:42.581Z] total 0
[2025-03-05T21:48:42.581Z] drwxr-xr-x 3 admin staff 96 Mar 5 16:17 jdk-11.0.27+4-static-libs
[2025-03-05T21:48:42.581Z] Moving directory jdk-11.0.27+4-static-libs/ to ../static-libs
[2025-03-05T21:48:42.581Z] Uncompressing file: OpenJDK11U-testimage_aarch64_mac_hotspot_11.0.27_4-ea.tar.gz ...
[2025-03-05T21:48:42.998Z] List files in jdkbinary folder...
[2025-03-05T21:48:42.998Z] total 580792
[2025-03-05T21:48:42.998Z] -rw-r--r-- 1 admin staff 36956091 Mar 5 16:18 OpenJDK11U-debugimage_aarch64_mac_hotspot_11.0.27_4-ea.tar.gz
[2025-03-05T21:48:42.998Z] -rw-r--r-- 1 admin staff 185093365 Mar 5 16:22 OpenJDK11U-jdk_aarch64_mac_hotspot_11.0.27_4-ea.tar.gz
[2025-03-05T21:48:42.998Z] -rw-r--r-- 1 admin staff 38119461 Mar 5 16:22 OpenJDK11U-jre_aarch64_mac_hotspot_11.0.27_4-ea.tar.gz
[2025-03-05T21:48:42.998Z] -rw-r--r-- 1 admin staff 26146 Mar 5 16:19 OpenJDK11U-sbom_aarch64_mac_hotspot_11.0.27_4-ea-metadata.json
[2025-03-05T21:48:42.999Z] -rw-r--r-- 1 admin staff 137517 Mar 5 16:38 OpenJDK11U-sbom_aarch64_mac_hotspot_11.0.27_4-ea.json
[2025-03-05T21:48:42.999Z] -rw-r--r-- 1 admin staff 3847108 Mar 5 16:22 OpenJDK11U-static-libs_aarch64_mac_hotspot_11.0.27_4-ea.tar.gz
[2025-03-05T21:48:43.000Z] -rw-r--r-- 1 admin staff 31039488 Mar 5 16:18 OpenJDK11U-testimage_aarch64_mac_hotspot_11.0.27_4-ea.tar.gz
[2025-03-05T21:48:43.000Z] drwxr-xr-x 3 admin staff 96 Mar 5 08:22 j2re-image
[2025-03-05T21:48:43.000Z] drwxr-xr-x 3 admin staff 96 Mar 5 08:21 j2sdk-image
[2025-03-05T21:48:43.000Z] drwxr-xr-x 3 admin staff 96 Mar 5 16:17 static-libs
[2025-03-05T21:48:43.000Z] drwxr-xr-x 3 admin staff 96 Mar 5 16:48 tmp
[2025-03-05T21:48:43.000Z] List files in jdkbinary/tmp folder...
[2025-03-05T21:48:43.000Z] total 0
[2025-03-05T21:48:43.000Z] drwxr-xr-x 6 admin staff 192 Mar 5 16:14 jdk-11.0.27+4-test-image
[2025-03-05T21:48:43.000Z] Moving directory jdk-11.0.27+4-test-image/ to ../openjdk-test-image
[2025-03-05T21:48:43.004Z] Uncompressing OpenJDK11U-debugimage_aarch64_mac_hotspot_11.0.27_4-ea.tar.gz over ./j2sdk-image...
[2025-03-05T21:48:43.394Z] Removing top-level folder jdk-11.0.27+4-debug-image/
[2025-03-05T21:48:43.394Z] Removing top-level folder jdk-11.0.27+4/
[2025-03-05T21:48:43.783Z] /Users/admin/workspace/workspace/Test_openjdk11_hs_extended.openjdk_aarch64_mac/jdkbinary/j2sdk-image/bin/java does not exist! Searching under TEST_JDK_HOME: /Users/admin/workspace/workspace/Test_openjdk11_hs_extended.openjdk_aarch64_mac/jdkbinary/j2sdk-image...
[2025-03-05T21:48:43.783Z] javac_path: /Users/admin/workspace/workspace/Test_openjdk11_hs_extended.openjdk_aarch64_mac/jdkbinary/j2sdk-image/Contents/Home/bin/javac
[2025-03-05T21:48:43.783Z] Run: /Users/admin/workspace/workspace/Test_openjdk11_hs_extended.openjdk_aarch64_mac/jdkbinary/j2sdk-image/Contents/Home/bin/java -version
[2025-03-05T21:48:43.783Z] =JAVA VERSION OUTPUT BEGIN=
[2025-03-05T21:48:45.125Z] openjdk version "11.0.27-beta" 2025-04-15
[2025-03-05T21:48:45.125Z] OpenJDK Runtime Environment Temurin-11.0.27+4-202503052104 (build 11.0.27-beta+4-ea)
[2025-03-05T21:48:45.125Z] OpenJDK 64-Bit Server VM Temurin-11.0.27+4-202503052104 (build 11.0.27-beta+4-ea, mixed mode)
[2025-03-05T21:48:45.125Z] =JAVA VERSION OUTPUT END=
[2025-03-05T21:48:45.125Z] get testKitGen...
[2025-03-05T21:48:45.125Z] git clone -q https://github.com/adoptium/TKG.git
[2025-03-05T21:48:46.154Z] git rev-parse master
[2025-03-05T21:48:46.154Z] git checkout -q -f 9579116b8c652502592349d2af9243fe181e7ae4
[Pipeline] }
[Pipeline] // withCredentials
[Pipeline] }
[Pipeline] // dir
[Pipeline] }
[2025-03-05T21:48:46.296Z] $ ssh-agent -k
[2025-03-05T21:48:46.311Z] unset SSH_AUTH_SOCK;
[2025-03-05T21:48:46.311Z] unset SSH_AGENT_PID;
[2025-03-05T21:48:46.311Z] echo Agent pid 655 killed;
[2025-03-05T21:48:46.534Z] [ssh-agent] Stopped.
[Pipeline] // sshagent
[Pipeline] fileExists
[Pipeline] echo
[2025-03-05T21:48:46.657Z] readProperties file: ./aqa-tests/job.properties
[Pipeline] readProperties
[Pipeline] echo
[2025-03-05T21:48:47.183Z] Reset TEST_JDK_HOME to /Users/admin/workspace/workspace/Test_openjdk11_hs_extended.openjdk_aarch64_mac/jdkbinary/j2sdk-image/Contents/Home/bin/../
[Pipeline] }
[Pipeline] // dir
[Pipeline] }
[Pipeline] // stage
[Pipeline] echo
[2025-03-05T21:48:48.059Z] Rerun in Grinder: https://ci.adoptium.net/job/Grinder/parambuild/?SDK_RESOURCE=upstream&TARGET=extended.openjdk&BASE_DOCKER_REGISTRY_CREDENTIAL_ID=&TEST_FLAG=&UPSTREAM_TEST_JOB_NAME=&DOCKER_REQUIRED=false&ACTIVE_NODE_TIMEOUT=5&VENDOR_TEST_DIRS=&EXTRA_DOCKER_ARGS=&TKG_OWNER_BRANCH=adoptium%3Amaster&OPENJ9_SYSTEMTEST_OWNER_BRANCH=eclipse%3Amaster&PLATFORM=aarch64_mac&GENERATE_JOBS=true&KEEP_REPORTDIR=true&PERSONAL_BUILD=false&DOCKER_REGISTRY_DIR=&RERUN_ITERATIONS=0&ADOPTOPENJDK_REPO=https%3A%2F%2Fgithub.com%2Fadoptium%2Faqa-tests.git&SETUP_JCK_RUN=false&DOCKER_REGISTRY_URL_CREDENTIAL_ID=&LABEL=&EXTRA_OPTIONS=&CUSTOMIZED_SDK_URL=&BUILD_IDENTIFIER=&JENKINS_KEY=&ADOPTOPENJDK_BRANCH=master&LIGHT_WEIGHT_CHECKOUT=false&USE_JRE=false&ARTIFACTORY_SERVER=&KEEP_WORKSPACE=false&USER_CREDENTIALS_ID=&JDK_VERSION=11&DOCKER_REGISTRY_URL=&ITERATIONS=1&VENDOR_TEST_REPOS=&JDK_REPO=https%3A%2F%2Fgithub.com%2Fadoptium%2Fjdk11u&JCK_GIT_BRANCH=master&OPENJ9_BRANCH=master&OPENJ9_SHA=&JCK_GIT_REPO=&VENDOR_TEST_BRANCHES=&UPSTREAM_JOB_NAME=build-scripts%2Fjobs%2Fjdk11u%2Fjdk11u-mac-aarch64-temurin&OPENJ9_REPO=https%3A%2F%2Fgithub.com%2Feclipse-openj9%2Fopenj9.git&CLOUD_PROVIDER=&CUSTOM_TARGET=&VENDOR_TEST_SHAS=&JDK_BRANCH=jdk-11.0.27%2B4_adopt&LABEL_ADDITION=&ARTIFACTORY_REPO=&ARTIFACTORY_ROOT_DIR=&UPSTREAM_TEST_JOB_NUMBER=&DOCKERIMAGE_TAG=&TEST_TIME=120&JDK_IMPL=hotspot&SSH_AGENT_CREDENTIAL=&AUTO_DETECT=true&SLACK_CHANNEL=aqavit-bot&DYNAMIC_COMPILE=false&RELATED_NODES=&ADOPTOPENJDK_SYSTEMTEST_OWNER_BRANCH=adoptium%3Amaster&APPLICATION_OPTIONS=&CUSTOMIZED_SDK_URL_CREDENTIAL_ID=eclipse_temurin_bot_email_and_token&ARCHIVE_TEST_RESULTS=false&NUM_MACHINES=&OPENJDK_SHA=&TRSS_URL=&RERUN_FAILURE=false&USE_TESTENV_PROPERTIES=false&BUILD_LIST=openjdk&ADDITIONAL_ARTIFACTS_REQUIRED=&UPSTREAM_JOB_NUMBER=371&STF_OWNER_BRANCH=adoptium%3Amaster&TIME_LIMIT=25&JVM_OPTIONS=&PARALLEL=None
[Pipeline] echo
[2025-03-05T21:48:48.095Z] Rerun in Grinder on same machine: https://ci.adoptium.net/job/Grinder/parambuild/?SDK_RESOURCE=upstream&TARGET=extended.openjdk&BASE_DOCKER_REGISTRY_CREDENTIAL_ID=&TEST_FLAG=&UPSTREAM_TEST_JOB_NAME=&DOCKER_REQUIRED=false&ACTIVE_NODE_TIMEOUT=5&VENDOR_TEST_DIRS=&EXTRA_DOCKER_ARGS=&TKG_OWNER_BRANCH=adoptium%3Amaster&OPENJ9_SYSTEMTEST_OWNER_BRANCH=eclipse%3Amaster&PLATFORM=aarch64_mac&GENERATE_JOBS=true&KEEP_REPORTDIR=true&PERSONAL_BUILD=false&DOCKER_REGISTRY_DIR=&RERUN_ITERATIONS=0&ADOPTOPENJDK_REPO=https%3A%2F%2Fgithub.com%2Fadoptium%2Faqa-tests.git&SETUP_JCK_RUN=false&DOCKER_REGISTRY_URL_CREDENTIAL_ID=&LABEL=test-orka-macos14-arm64-f7v64&EXTRA_OPTIONS=&CUSTOMIZED_SDK_URL=&BUILD_IDENTIFIER=&JENKINS_KEY=&ADOPTOPENJDK_BRANCH=master&LIGHT_WEIGHT_CHECKOUT=false&USE_JRE=false&ARTIFACTORY_SERVER=&KEEP_WORKSPACE=false&USER_CREDENTIALS_ID=&JDK_VERSION=11&DOCKER_REGISTRY_URL=&ITERATIONS=1&VENDOR_TEST_REPOS=&JDK_REPO=https%3A%2F%2Fgithub.com%2Fadoptium%2Fjdk11u&JCK_GIT_BRANCH=master&OPENJ9_BRANCH=master&OPENJ9_SHA=&JCK_GIT_REPO=&VENDOR_TEST_BRANCHES=&UPSTREAM_JOB_NAME=build-scripts%2Fjobs%2Fjdk11u%2Fjdk11u-mac-aarch64-temurin&OPENJ9_REPO=https%3A%2F%2Fgithub.com%2Feclipse-openj9%2Fopenj9.git&CLOUD_PROVIDER=&CUSTOM_TARGET=&VENDOR_TEST_SHAS=&JDK_BRANCH=jdk-11.0.27%2B4_adopt&LABEL_ADDITION=&ARTIFACTORY_REPO=&ARTIFACTORY_ROOT_DIR=&UPSTREAM_TEST_JOB_NUMBER=&DOCKERIMAGE_TAG=&TEST_TIME=120&JDK_IMPL=hotspot&SSH_AGENT_CREDENTIAL=&AUTO_DETECT=true&SLACK_CHANNEL=aqavit-bot&DYNAMIC_COMPILE=false&RELATED_NODES=&ADOPTOPENJDK_SYSTEMTEST_OWNER_BRANCH=adoptium%3Amaster&APPLICATION_OPTIONS=&CUSTOMIZED_SDK_URL_CREDENTIAL_ID=eclipse_temurin_bot_email_and_token&ARCHIVE_TEST_RESULTS=false&NUM_MACHINES=&OPENJDK_SHA=&TRSS_URL=&RERUN_FAILURE=false&USE_TESTENV_PROPERTIES=false&BUILD_LIST=openjdk&ADDITIONAL_ARTIFACTS_REQUIRED=&UPSTREAM_JOB_NUMBER=371&STF_OWNER_BRANCH=adoptium%3Amaster&TIME_LIMIT=25&JVM_OPTIONS=&PARALLEL=None
[Pipeline] stage
[Pipeline] { (setupParallelEnv)
[Pipeline] timeout
[2025-03-05T21:48:48.210Z] Timeout set to expire in 1 hr 0 min
[Pipeline] {
[Pipeline] copyArtifacts
[2025-03-05T21:48:48.549Z] Copied 1 artifact from "getTRSSOutput" build number 1702
[Pipeline] sh
[2025-03-05T21:48:49.222Z] + cd ./aqa-tests/TKG/resources/TRSS
[2025-03-05T21:48:49.222Z] + gzip -cd TRSSOutput.tar.gz
[2025-03-05T21:48:49.222Z] + tar xof -
[2025-03-05T21:48:49.222Z] + rm TRSSOutput.tar.gz
[Pipeline] }
[Pipeline] // timeout
[Pipeline] timeout
[2025-03-05T21:48:49.435Z] Timeout set to expire in 20 min
[Pipeline] {
[Pipeline] echo
[2025-03-05T21:48:49.538Z] Custom URL: https://ci.adoptium.net//job/test.getDependency/lastSuccessfulBuild/artifact/
[Pipeline] sh
[2025-03-05T21:48:50.224Z] + perl ./aqa-tests/TKG/scripts/getDependencies.pl -path /Users/admin/workspace/workspace/Test_openjdk11_hs_extended.openjdk_aarch64_mac/../../testDependency/lib -task default -customUrl https://ci.adoptium.net//job/test.getDependency/lastSuccessfulBuild/artifact/
[2025-03-05T21:48:50.224Z] /Users/admin/workspace/workspace/Test_openjdk11_hs_extended.openjdk_aarch64_mac/../../testDependency/lib does not exist, creating one.
[2025-03-05T21:48:50.224Z] mkdir /Users/admin/workspace/workspace/Test_openjdk11_hs_extended.openjdk_aarch64_mac/../../testDependency
[2025-03-05T21:48:50.224Z] mkdir /Users/admin/workspace/workspace/Test_openjdk11_hs_extended.openjdk_aarch64_mac/../../testDependency/lib
[2025-03-05T21:48:50.224Z] --------------------------------------------
[2025-03-05T21:48:50.224Z] path is set to /Users/admin/workspace/workspace/Test_openjdk11_hs_extended.openjdk_aarch64_mac/../../testDependency/lib
[2025-03-05T21:48:50.224Z] task is set to default
[2025-03-05T21:48:50.224Z] dependencyList is set to all
[2025-03-05T21:48:50.224Z] --------------------------------------------
[2025-03-05T21:48:50.224Z] Starting download third party dependent jars
[2025-03-05T21:48:50.224Z] --------------------------------------------
[2025-03-05T21:48:50.224Z] downloading dependent third party jars to /Users/admin/workspace/workspace/Test_openjdk11_hs_extended.openjdk_aarch64_mac/../../testDependency/lib
[2025-03-05T21:48:50.224Z] downloading https://ci.adoptium.net//job/test.getDependency/lastSuccessfulBuild/artifact//apache-maven-bin.tar.gz
[2025-03-05T21:48:50.615Z] --> file downloaded to /Users/admin/workspace/workspace/Test_openjdk11_hs_extended.openjdk_aarch64_mac/../../testDependency/lib/apache-maven-bin.tar.gz
[2025-03-05T21:48:50.615Z] downloading https://ci.adoptium.net//job/test.getDependency/lastSuccessfulBuild/artifact//jtreg_6_1.tar.gz.sha256sum.txt
[2025-03-05T21:48:51.021Z] --> file downloaded to /Users/admin/workspace/workspace/Test_openjdk11_hs_extended.openjdk_aarch64_mac/../../testDependency/lib/jtreg_6_1.tar.gz.sha256sum.txt
[2025-03-05T21:48:51.021Z] downloading https://ci.adoptium.net//job/test.getDependency/lastSuccessfulBuild/artifact//jtreg_6_1.tar.gz
[2025-03-05T21:48:51.416Z] --> file downloaded to /Users/admin/workspace/workspace/Test_openjdk11_hs_extended.openjdk_aarch64_mac/../../testDependency/lib/jtreg_6_1.tar.gz
[2025-03-05T21:48:51.416Z] downloading https://ci.adoptium.net//job/test.getDependency/lastSuccessfulBuild/artifact//jtreg_6_1.tar.gz.sha256sum.txt
[2025-03-05T21:48:51.416Z] --> file downloaded to /Users/admin/workspace/workspace/Test_openjdk11_hs_extended.openjdk_aarch64_mac/../../testDependency/lib/jtreg_6_1.tar.gz.sha256sum.txt
[2025-03-05T21:48:51.416Z] downloading https://ci.adoptium.net//job/test.getDependency/lastSuccessfulBuild/artifact//jaxb-api.jar
[2025-03-05T21:48:51.835Z] --> file downloaded to /Users/admin/workspace/workspace/Test_openjdk11_hs_extended.openjdk_aarch64_mac/../../testDependency/lib/jaxb-api.jar
[2025-03-05T21:48:51.835Z] downloading https://ci.adoptium.net//job/test.getDependency/lastSuccessfulBuild/artifact//json-simple.jar
[2025-03-05T21:48:52.247Z] --> file downloaded to /Users/admin/workspace/workspace/Test_openjdk11_hs_extended.openjdk_aarch64_mac/../../testDependency/lib/json-simple.jar
[2025-03-05T21:48:52.247Z] downloading https://ci.adoptium.net//job/test.getDependency/lastSuccessfulBuild/artifact//commons-exec.jar
[2025-03-05T21:48:52.247Z] --> file downloaded to /Users/admin/workspace/workspace/Test_openjdk11_hs_extended.openjdk_aarch64_mac/../../testDependency/lib/commons-exec.jar
[2025-03-05T21:48:52.247Z] downloading https://ci.adoptium.net//job/test.getDependency/lastSuccessfulBuild/artifact//junit4.jar
[2025-03-05T21:48:52.725Z] --> file downloaded to /Users/admin/workspace/workspace/Test_openjdk11_hs_extended.openjdk_aarch64_mac/../../testDependency/lib/junit4.jar
[2025-03-05T21:48:52.725Z] downloading https://ci.adoptium.net//job/test.getDependency/lastSuccessfulBuild/artifact//asmtools.jar.sha256sum.txt
[2025-03-05T21:48:52.725Z] --> file downloaded to /Users/admin/workspace/workspace/Test_openjdk11_hs_extended.openjdk_aarch64_mac/../../testDependency/lib/asmtools.jar.sha256sum.txt
[2025-03-05T21:48:52.725Z] downloading https://ci.adoptium.net//job/test.getDependency/lastSuccessfulBuild/artifact//asmtools.jar
[2025-03-05T21:48:53.143Z] --> file downloaded to /Users/admin/workspace/workspace/Test_openjdk11_hs_extended.openjdk_aarch64_mac/../../testDependency/lib/asmtools.jar
[2025-03-05T21:48:53.143Z] downloading https://ci.adoptium.net//job/test.getDependency/lastSuccessfulBuild/artifact//asmtools.jar.sha256sum.txt
[2025-03-05T21:48:53.555Z] --> file downloaded to /Users/admin/workspace/workspace/Test_openjdk11_hs_extended.openjdk_aarch64_mac/../../testDependency/lib/asmtools.jar.sha256sum.txt
[2025-03-05T21:48:53.555Z] downloading https://ci.adoptium.net//job/test.getDependency/lastSuccessfulBuild/artifact//commons-cli.jar
[2025-03-05T21:48:53.555Z] --> file downloaded to /Users/admin/workspace/workspace/Test_openjdk11_hs_extended.openjdk_aarch64_mac/../../testDependency/lib/commons-cli.jar
[2025-03-05T21:48:53.555Z] downloading https://ci.adoptium.net//job/test.getDependency/lastSuccessfulBuild/artifact//jtreg_7_5_1.tar.gz.sha256sum.txt
[2025-03-05T21:48:53.960Z] --> file downloaded to /Users/admin/workspace/workspace/Test_openjdk11_hs_extended.openjdk_aarch64_mac/../../testDependency/lib/jtreg_7_5_1.tar.gz.sha256sum.txt
[2025-03-05T21:48:53.960Z] downloading https://ci.adoptium.net//job/test.getDependency/lastSuccessfulBuild/artifact//jtreg_7_5_1.tar.gz
[2025-03-05T21:48:54.376Z] --> file downloaded to /Users/admin/workspace/workspace/Test_openjdk11_hs_extended.openjdk_aarch64_mac/../../testDependency/lib/jtreg_7_5_1.tar.gz
[2025-03-05T21:48:54.376Z] downloading https://ci.adoptium.net//job/test.getDependency/lastSuccessfulBuild/artifact//jtreg_7_5_1.tar.gz.sha256sum.txt
[2025-03-05T21:48:54.376Z] ERROR: sha checksum error.
[2025-03-05T21:48:54.376Z] --> file downloaded to /Users/admin/workspace/workspace/Test_openjdk11_hs_extended.openjdk_aarch64_mac/../../testDependency/lib/jtreg_7_5_1.tar.gz.sha256sum.txt
[2025-03-05T21:48:54.376Z] Expected sha is:
[2025-03-05T21:48:54.376Z] ,
[2025-03-05T21:48:54.376Z] Actual sha is : a0cf40d3497092d1f37073ea039a72b5ea28daf69f28ee228b1c119f2c10ec3a.
[2025-03-05T21:48:54.505Z] Please delete /Users/admin/workspace/workspace/Test_openjdk11_hs_extended.openjdk_aarch64_mac/../../testDependency/lib/jtreg_7_5_1.tar.gz and rerun the program!
[Pipeline] }
[Pipeline] // timeout
[Pipeline] echo
[2025-03-05T21:48:54.551Z] Exception: hudson.AbortException: script returned exit code 255
[Pipeline] echo
[2025-03-05T21:48:54.557Z] Cannot pre-stage test libs from /Users/admin/workspace/workspace/Test_openjdk11_hs_extended.openjdk_aarch64_mac/../../testDependency/lib on the machine. Skipping...
[Pipeline] nodesByLabel
[2025-03-05T21:48:54.583Z] Found a total of 9 nodes with the 'ci.role.test&&hw.arch.aarch64&&(sw.os.osx||sw.os.mac)' label
[Pipeline] sh
[2025-03-05T21:48:55.267Z] + cd ./aqa-tests/TKG
[2025-03-05T21:48:55.267Z] ++ uname
[2025-03-05T21:48:55.267Z] + '[' Darwin = AIX ']'
[2025-03-05T21:48:55.267Z] ++ uname
[2025-03-05T21:48:55.267Z] + '[' Darwin = SunOS ']'
[2025-03-05T21:48:55.267Z] ++ uname
[2025-03-05T21:48:55.267Z] + '[' Darwin = '*BSD' ']'
[2025-03-05T21:48:55.267Z] + MAKE=make
[2025-03-05T21:48:55.267Z] + make genParallelList TEST=extended.openjdk TEST_TIME=120 NUM_MACHINES=
[2025-03-05T21:48:55.657Z] JAVA_HOME is set to /Users/admin/workspace/workspace/Test_openjdk11_hs_extended.openjdk_aarch64_mac/jdkbinary/j2sdk-image/Contents/Home/bin/../
[2025-03-05T21:48:55.657Z] LIB_DIR is set to /Users/admin/workspace/workspace/Test_openjdk11_hs_extended.openjdk_aarch64_mac/../../testDependency/lib
[2025-03-05T21:48:55.657Z] rm -f -r /Users/admin/workspace/workspace/Test_openjdk11_hs_extended.openjdk_aarch64_mac/aqa-tests/TKG/../TKG/output_compilation; \
[2025-03-05T21:48:55.657Z] mkdir -p /Users/admin/workspace/workspace/Test_openjdk11_hs_extended.openjdk_aarch64_mac/aqa-tests/TKG/../TKG/output_compilation; \
[2025-03-05T21:48:55.657Z] (ant -f ./scripts/build_tools.xml "-DTEST_JDK_HOME=/Users/admin/workspace/workspace/Test_openjdk11_hs_extended.openjdk_aarch64_mac/jdkbinary/j2sdk-image/Contents/Home/bin/../" "-DTEST_ROOT=/Users/admin/workspace/workspace/Test_openjdk11_hs_extended.openjdk_aarch64_mac/aqa-tests/TKG/.." "-DLIB_DIR=/Users/admin/workspace/workspace/Test_openjdk11_hs_extended.openjdk_aarch64_mac/../../testDependency/lib" 2>&1; echo $? ) | tee "/Users/admin/workspace/workspace/Test_openjdk11_hs_extended.openjdk_aarch64_mac/aqa-tests/TKG/../TKG/output_compilation/compilation.log"; \
[2025-03-05T21:48:55.657Z] if [ -z "$(tail -1 /Users/admin/workspace/workspace/Test_openjdk11_hs_extended.openjdk_aarch64_mac/aqa-tests/TKG/../TKG/output_compilation/compilation.log | grep 0)" ]; then perl scripts/moveDmp.pl --compileLogPath="/Users/admin/workspace/workspace/Test_openjdk11_hs_extended.openjdk_aarch64_mac/aqa-tests/TKG/../TKG/output_compilation/compilation.log" --testRoot="/Users/admin/workspace/workspace/Test_openjdk11_hs_extended.openjdk_aarch64_mac/aqa-tests/TKG/.."; false; else rm -f -r "/Users/admin/workspace/workspace/Test_openjdk11_hs_extended.openjdk_aarch64_mac/aqa-tests/TKG/../TKG/output_compilation"; fi
[2025-03-05T21:48:56.490Z] Buildfile: /Users/admin/workspace/workspace/Test_openjdk11_hs_extended.openjdk_aarch64_mac/aqa-tests/TKG/scripts/build_tools.xml
[2025-03-05T21:48:56.490Z]
[2025-03-05T21:48:56.490Z] build:
[2025-03-05T21:48:56.490Z]
[2025-03-05T21:48:56.490Z] clean:
[2025-03-05T21:48:56.490Z]
[2025-03-05T21:48:56.490Z] init:
[2025-03-05T21:48:56.490Z] [mkdir] Created dir: /Users/admin/workspace/workspace/Test_openjdk11_hs_extended.openjdk_aarch64_mac/aqa-tests/TKG/bin
[2025-03-05T21:48:56.490Z]
[2025-03-05T21:48:56.490Z] getDependentLibs:
[2025-03-05T21:48:56.886Z] [exec] --------------------------------------------
[2025-03-05T21:48:56.886Z] [exec] path is set to /Users/admin/workspace/workspace/Test_openjdk11_hs_extended.openjdk_aarch64_mac/../../testDependency/lib
[2025-03-05T21:48:56.886Z] [exec] task is set to default
[2025-03-05T21:48:56.886Z] [exec] dependencyList is set to json_simple
[2025-03-05T21:48:56.886Z] [exec] --------------------------------------------
[2025-03-05T21:48:56.886Z] [exec] Starting download third party dependent jars
[2025-03-05T21:48:56.886Z] [exec] --------------------------------------------
[2025-03-05T21:48:56.886Z] [exec] downloading dependent third party jars to /Users/admin/workspace/workspace/Test_openjdk11_hs_extended.openjdk_aarch64_mac/../../testDependency/lib
[2025-03-05T21:48:56.886Z] [exec] /Users/admin/workspace/workspace/Test_openjdk11_hs_extended.openjdk_aarch64_mac/../../testDependency/lib/json-simple.jar exists with correct hash, not downloading
[2025-03-05T21:48:56.886Z] [exec] downloaded dependent third party jars successfully
[2025-03-05T21:48:56.886Z]
[2025-03-05T21:48:56.886Z] compile:
[2025-03-05T21:48:56.886Z] [echo] Ant version is Apache Ant(TM) version 1.10.5 compiled on July 10 2018
[2025-03-05T21:48:56.886Z] [echo] ============COMPILER SETTINGS============
[2025-03-05T21:48:56.886Z] [echo] ===fork: yes
[2025-03-05T21:48:56.886Z] [echo] ===debug: on
[2025-03-05T21:48:56.886Z] [javac] Compiling 28 source files to /Users/admin/workspace/workspace/Test_openjdk11_hs_extended.openjdk_aarch64_mac/aqa-tests/TKG/bin
[2025-03-05T21:48:57.829Z]
[2025-03-05T21:48:57.829Z] dist:
[2025-03-05T21:48:57.829Z] [jar] Building jar: /Users/admin/workspace/workspace/Test_openjdk11_hs_extended.openjdk_aarch64_mac/aqa-tests/TKG/bin/TestKitGen.jar
[2025-03-05T21:48:57.829Z]
[2025-03-05T21:48:57.829Z] BUILD SUCCESSFUL
[2025-03-05T21:48:57.829Z] Total time: 1 second
[2025-03-05T21:48:57.829Z] 0
[2025-03-05T21:48:57.829Z] /Users/admin/workspace/workspace/Test_openjdk11_hs_extended.openjdk_aarch64_mac/jdkbinary/j2sdk-image/Contents/Home/bin/..//bin/java -cp ./bin/TestKitGen.jar org.openj9.envInfo.EnvDetector
[2025-03-05T21:48:57.829Z] Unfamiliar microArch detected in TKG. It will not be added in TKG microArch!
[2025-03-05T21:48:57.829Z] microArchOutput: cat: /proc/cpuinfo: No such file or directory
[2025-03-05T21:49:04.353Z] ****************************** MACHINE INFO ******************************
[2025-03-05T21:49:04.353Z] File path : /Users/admin/workspace/workspace/Test_openjdk11_hs_extended.openjdk_aarch64_mac/aqa-tests/TKG
[2025-03-05T21:49:04.353Z] Free Physical Memory Size : 204914688
[2025-03-05T21:49:04.353Z] Free space (bytes) : 45440217088
[2025-03-05T21:49:04.353Z] Total Physical Memory Size : 5368709120
[2025-03-05T21:49:04.353Z] Total space (bytes) : 90743767040
[2025-03-05T21:49:04.353Z] Usable space (bytes) : 45440217088
[2025-03-05T21:49:04.353Z] antVersion : Apache Ant(TM) version 1.10.5 compiled on July 10 2018
[2025-03-05T21:49:04.353Z] bashVersion :
[2025-03-05T21:49:04.353Z] GNU bash, version 5.2.26(1)-release (aarch64-apple-darwin23.2.0)
[2025-03-05T21:49:04.353Z] Copyright (C) 2022 Free Software Foundation, Inc.
[2025-03-05T21:49:04.353Z] License GPLv3+: GNU GPL version 3 or later <http://gnu.org/licenses/gpl.html>
[2025-03-05T21:49:04.353Z]
[2025-03-05T21:49:04.353Z] This is free software; you are free to change and redistribute it.
[2025-03-05T21:49:04.353Z] There is NO WARRANTY, to the extent permitted by law.
[2025-03-05T21:49:04.353Z] cpuCores : 3
[2025-03-05T21:49:04.353Z] curlVersion :
[2025-03-05T21:49:04.353Z] curl 8.1.2 (x86_64-apple-darwin23.0) libcurl/8.1.2 (SecureTransport) LibreSSL/3.3.6 zlib/1.2.12 nghttp2/1.55.1
[2025-03-05T21:49:04.353Z] Release-Date: 2023-05-30
[2025-03-05T21:49:04.353Z] Protocols: dict file ftp ftps gopher gophers http https imap imaps ldap ldaps mqtt pop3 pop3s rtsp smb smbs smtp smtps telnet tftp
[2025-03-05T21:49:04.353Z] Features: alt-svc AsynchDNS GSS-API HSTS HTTP2 HTTPS-proxy IPv6 Kerberos Largefile libz MultiSSL NTLM NTLM_WB SPNEGO SSL threadsafe UnixSockets
[2025-03-05T21:49:04.353Z] dockerVersion : bash: line 1: docker: command not found
[2025-03-05T21:49:04.353Z] gcc version : 15.0.0
[2025-03-05T21:49:04.353Z] gclibc version : bash: line 1: ldd: command not found
[2025-03-05T21:49:04.353Z] gdb version : bash: line 1: gdb: command not found
[2025-03-05T21:49:04.353Z] lldb version :
[2025-03-05T21:49:04.353Z] lldb-1500.0.200.58
[2025-03-05T21:49:04.353Z] Apple Swift version 5.9.2 (swiftlang-5.9.2.2.56 clang-1500.1.0.2.5)
[2025-03-05T21:49:04.353Z] makeVersion :
[2025-03-05T21:49:04.353Z] GNU Make 3.81
[2025-03-05T21:49:04.353Z] Copyright (C) 2006 Free Software Foundation, Inc.
[2025-03-05T21:49:04.353Z] This is free software; see the source for copying conditions.
[2025-03-05T21:49:04.353Z] There is NO warranty; not even for MERCHANTABILITY or FITNESS FOR A
[2025-03-05T21:49:04.353Z] PARTICULAR PURPOSE.
[2025-03-05T21:49:04.353Z]
[2025-03-05T21:49:04.353Z] This program built for i386-apple-darwin11.3.0
[2025-03-05T21:49:04.353Z] mavenVersion :
[2025-03-05T21:49:04.353Z] [1mApache Maven 3.6.3 (cecedd343002696d0abb50b32b541b8a6ba2883f)[m
[2025-03-05T21:49:04.353Z] Maven home: /usr/local/apache-maven-3.6.3
[2025-03-05T21:49:04.353Z] Java version: 11.0.27-beta, vendor: Eclipse Adoptium, runtime: /Users/admin/workspace/workspace/Test_openjdk11_hs_extended.openjdk_aarch64_mac/jdkbinary/j2sdk-image/Contents/Home
[2025-03-05T21:49:04.353Z] Default locale: en_US, platform encoding: UTF-8
[2025-03-05T21:49:04.353Z] OS name: "mac os x", version: "14.1", arch: "aarch64", family: "mac"
[2025-03-05T21:49:04.353Z] perlVersion :
[2025-03-05T21:49:04.353Z]
[2025-03-05T21:49:04.353Z] This is perl 5, version 30, subversion 3 (v5.30.3) built for darwin-thread-multi-2level
[2025-03-05T21:49:04.353Z] (with 2 registered patches, see perl -V for more detail)
[2025-03-05T21:49:04.353Z]
[2025-03-05T21:49:04.353Z] Copyright 1987-2020, Larry Wall
[2025-03-05T21:49:04.353Z]
[2025-03-05T21:49:04.353Z] Perl may be copied only under the terms of either the Artistic License or the
[2025-03-05T21:49:04.353Z] GNU General Public License, which may be found in the Perl 5 source kit.
[2025-03-05T21:49:04.353Z]
[2025-03-05T21:49:04.353Z] Complete documentation for Perl, including FAQ lists, should be found on
[2025-03-05T21:49:04.353Z] this system using "man perl" or "perldoc perl". If you have access to the
[2025-03-05T21:49:04.353Z] Internet, point your browser at http://www.perl.org/, the Perl Home Page.
[2025-03-05T21:49:04.353Z]
[2025-03-05T21:49:04.353Z] podmanVersion : bash: line 1: podman: command not found
[2025-03-05T21:49:04.353Z] procArch : arm
[2025-03-05T21:49:04.353Z] sysArch : arm64
[2025-03-05T21:49:04.353Z] sysOS : Darwin
[2025-03-05T21:49:04.353Z] ulimit :
[2025-03-05T21:49:04.353Z] core file size (blocks, -c) 0
[2025-03-05T21:49:04.353Z] data seg size (kbytes, -d) unlimited
[2025-03-05T21:49:04.353Z] file size (blocks, -f) unlimited
[2025-03-05T21:49:04.353Z] max locked memory (kbytes, -l) unlimited
[2025-03-05T21:49:04.353Z] max memory size (kbytes, -m) unlimited
[2025-03-05T21:49:04.353Z] open files (-n) 10240
[2025-03-05T21:49:04.353Z] pipe size (512 bytes, -p) 1
[2025-03-05T21:49:04.353Z] stack size (kbytes, -s) 65520
[2025-03-05T21:49:04.353Z] cpu time (seconds, -t) unlimited
[2025-03-05T21:49:04.354Z] max user processes (-u) 1333
[2025-03-05T21:49:04.354Z] virtual memory (kbytes, -v) unlimited
[2025-03-05T21:49:04.354Z] uname : Darwin admins-Virtual-Machine.local 23.1.0 Darwin Kernel Version 23.1.0: Mon Oct 9 21:26:29 PDT 2023; root:xnu-10002.41.9~6/RELEASE_ARM64_VMAPPLE arm64
[2025-03-05T21:49:04.354Z] vmVendor : Oracle Corporation
[2025-03-05T21:49:04.354Z] vmVersion : 11.0.27-beta+4-ea
[2025-03-05T21:49:04.354Z] xlc version : bash: line 1: xlC: command not found
[2025-03-05T21:49:04.354Z] **************************************************************************
[2025-03-05T21:49:04.354Z]
[2025-03-05T21:49:04.354Z] System.getProperty('java.vm.name')=OpenJDK 64-Bit Server VM
[2025-03-05T21:49:04.354Z]
[2025-03-05T21:49:04.354Z] System.getProperty('java.vendor')=Eclipse Adoptium
[2025-03-05T21:49:04.354Z]
[2025-03-05T21:49:04.354Z] System.getProperty('os.name')=Mac OS X
[2025-03-05T21:49:04.354Z]
[2025-03-05T21:49:04.354Z] System.getProperty('os.arch')=aarch64
[2025-03-05T21:49:04.354Z]
[2025-03-05T21:49:04.354Z] System.getProperty('java.fullversion')=null
[2025-03-05T21:49:04.354Z]
[2025-03-05T21:49:04.354Z] System.getProperty('sun.arch.data.model')=64
[2025-03-05T21:49:04.354Z]
[2025-03-05T21:49:04.354Z] /Applications/Xcode.app/Contents/Developer/usr/bin/make -f makeGen.mk AUTO_DETECT=true MODE=parallelList NUM_MACHINES= TEST_TIME=120 TESTTARGET=extended.openjdk TESTLIST= TRSS_URL= LIB_DIR=/Users/admin/workspace/workspace/Test_openjdk11_hs_extended.openjdk_aarch64_mac/../../testDependency/lib
[2025-03-05T21:49:04.354Z] perl scripts/configure.pl
[2025-03-05T21:49:04.354Z] /Users/admin/workspace/workspace/Test_openjdk11_hs_extended.openjdk_aarch64_mac/jdkbinary/j2sdk-image/Contents/Home/bin/..//bin/java -cp "./bin/TestKitGen.jar:/Users/admin/workspace/workspace/Test_openjdk11_hs_extended.openjdk_aarch64_mac/../../testDependency/lib/json-simple.jar" org.testKitGen.MainRunner --mode=parallelList --spec=osx_aarch64 --microArch="" --osLabel="" --jdkVersion=11 --impl=hotspot --vendor="eclipse" --buildList=openjdk --iterations=1 --aotIterations= --testFlag= --testTarget=extended.openjdk --testList= --numOfMachines= --testTime=120 --TRSSURL=
[2025-03-05T21:49:04.354Z]
[2025-03-05T21:49:04.354Z] Warning: cannot find spec in resources/ottawa.csv.
[2025-03-05T21:49:04.354Z] Detected 64 in spec. Use spec: default-64 to match mode.
[2025-03-05T21:49:04.354Z]
[2025-03-05T21:49:04.354Z] Modes data parsed from resources/modes.xml and resources/ottawa.csv.
[2025-03-05T21:49:04.354Z]
[2025-03-05T21:49:04.354Z]
[2025-03-05T21:49:04.354Z] Starting to generate parallel test lists.
[2025-03-05T21:49:04.354Z]
[2025-03-05T21:49:04.354Z] Parsing /Users/admin/workspace/workspace/Test_openjdk11_hs_extended.openjdk_aarch64_mac/aqa-tests/TKG/../openjdk/playlist.xml
[2025-03-05T21:49:04.354Z] Attempting to get test duration data from TRSS.
[2025-03-05T21:49:04.354Z] curl --silent --max-time 120 -L -k https://trss.adoptopenjdk.net/api/getTestAvgDuration?limit=10&jdkVersion=11&impl=hs&platform=aarch64_mac&group=openjdk&level=extended
[2025-03-05T21:49:04.753Z] Attempting to get test duration data from cached files.
[2025-03-05T21:49:04.753Z]
[2025-03-05T21:49:04.753Z] TEST DURATION
[2025-03-05T21:49:04.753Z] ====================================================================================
[2025-03-05T21:49:04.753Z] Total number of tests searched: 83
[2025-03-05T21:49:04.753Z] Number of test durations found: 83
[2025-03-05T21:49:04.753Z] Top slowest tests:
[2025-03-05T21:49:04.753Z] 89m31s hotspot_gc_0
[2025-03-05T21:49:04.753Z] 43m24s hotspot_compiler_0
[2025-03-05T21:49:04.753Z] 28m25s jdk_net_1
[2025-03-05T21:49:04.753Z] ====================================================================================
[2025-03-05T21:49:04.753Z]
[2025-03-05T21:49:04.753Z] Test target is split into 3 lists.
[2025-03-05T21:49:04.753Z] Reducing estimated test running time from 327m03s to 116m21s.
[2025-03-05T21:49:04.753Z]
[2025-03-05T21:49:04.753Z] -------------------------------------testList_0-------------------------------------
[2025-03-05T21:49:04.753Z] Number of tests: 3
[2025-03-05T21:49:04.753Z] Estimated running time: 116m21s
[2025-03-05T21:49:04.753Z] TESTLIST=hotspot_gc_0,jdk_security3_0,jdk_rmi_1
[2025-03-05T21:49:04.753Z] ------------------------------------------------------------------------------------
[2025-03-05T21:49:04.753Z]
[2025-03-05T21:49:04.753Z] -------------------------------------testList_1-------------------------------------
[2025-03-05T21:49:04.753Z] Number of tests: 4
[2025-03-05T21:49:04.753Z] Estimated running time: 114m06s
[2025-03-05T21:49:04.753Z] TESTLIST=hotspot_compiler_0,jdk_net_1,jdk_net_0,jdk_security3_1
[2025-03-05T21:49:04.753Z] ------------------------------------------------------------------------------------
[2025-03-05T21:49:04.753Z]
[2025-03-05T21:49:04.753Z] -------------------------------------testList_2-------------------------------------
[2025-03-05T21:49:04.753Z] Number of tests: 76
[2025-03-05T21:49:04.753Z] Estimated running time: 96m36s
[2025-03-05T21:49:04.753Z] TESTLIST=jdk_rmi_0,jdk_nio_0,jdk_nio_1,jdk_jdi_0,jdk_jdi_1,jdk_jmx_1,jdk_jmx_0,hotspot_runtime_0,jdk_tools_0,jdk_tools_1,jdk_other_1,jdk_other_0,jdk_jfr_1,jdk_jfr_0,jdk_beans_0,jdk_beans_1,hotspot_serviceability_0,jdk_management_0,jdk_management_1,jdk_io_0,jdk_io_1,jdk_instrument_1,jdk_instrument_0,jdk_text_0,jdk_text_1,jdk_time_1,jdk_time_0,jdk_build_0,jdk_build_1,hotspot_native_sanity_0,jdk_native_sanity_0,jdk_native_sanity_1,jdk_awt_2,jdk_awt_1,jdk_awt_0,jdk_swing_0,jdk_swing_2,jdk_swing_1,jdk_sound_2,jdk_sound_1,jdk_sound_0,jdk_security_infra_2,jdk_security_infra_0,jdk_imageio_2,jdk_client_sanity_2,jdk_client_sanity_0,jdk_2d_0,jdk_security_infra_1,jdk_jfc_demo_2,jdk_jfc_demo_1,jdk_jfc_demo_0,jdk_imageio_1,jdk_imageio_0,jdk_client_sanity_1,jdk_beans_2,jdk_2d_2,jdk_2d_1,jdk_tools_2,jdk_text_2,jdk_security3_2,jdk_rmi_2,jdk_other_2,jdk_nio_2,jdk_net_2,jdk_jdi_2,jdk_time_2,jdk_security_infra_zos_2,jdk_security_infra_zos_1,jdk_security_infra_zos_0,jdk_native_sanity_2,jdk_management_2,jdk_jmx_2,jdk_jfr_2,jdk_io_2,jdk_instrument_2,jdk_build_2
[2025-03-05T21:49:04.753Z] ------------------------------------------------------------------------------------
[2025-03-05T21:49:04.753Z]
[2025-03-05T21:49:04.753Z] Parallel test lists file (/Users/admin/workspace/workspace/Test_openjdk11_hs_extended.openjdk_aarch64_mac/aqa-tests/TKG/../TKG/parallelList.mk) is generated successfully.
[Pipeline] fileExists
[Pipeline] echo
[2025-03-05T21:49:04.903Z] read parallelList.mk file: aqa-tests/TKG/parallelList.mk
[Pipeline] readProperties
[Pipeline] echo
[2025-03-05T21:49:05.018Z] Saving parallelList.mk file on jenkins...
[Pipeline] dir
[2025-03-05T21:49:05.020Z] Running in /Users/admin/workspace/workspace/Test_openjdk11_hs_extended.openjdk_aarch64_mac/aqa-tests/TKG
[Pipeline] {
[Pipeline] archiveArtifacts
[2025-03-05T21:49:05.078Z] Archiving artifacts
[2025-03-05T21:49:05.985Z] Recording fingerprints
[Pipeline] }
[Pipeline] // dir
[Pipeline] echo
[2025-03-05T21:49:06.095Z] [PARALLEL: Dynamic] childJobNum is 3, creating jobs and running them in parallel...
[Pipeline] parallel
[Pipeline] { (Branch: testList_0)
[Pipeline] { (Branch: testList_1)
[Pipeline] { (Branch: testList_2)
[Pipeline] echo
[2025-03-05T21:49:06.604Z] GENERATE_JOBS is set to true, set test job Test_openjdk11_hs_extended.openjdk_aarch64_mac_testList_0 params for generating the job
[Pipeline] echo
[2025-03-05T21:49:06.605Z] GENERATE_JOBS is set to true, set test job Test_openjdk11_hs_extended.openjdk_aarch64_mac_testList_1 params for generating the job
[Pipeline] echo
[2025-03-05T21:49:06.606Z] GENERATE_JOBS is set to true, set test job Test_openjdk11_hs_extended.openjdk_aarch64_mac_testList_2 params for generating the job
[Pipeline] fileExists
[Pipeline] fileExists
[Pipeline] fileExists
[Pipeline] jobDsl
[Pipeline] jobDsl
[Pipeline] jobDsl
[2025-03-05T21:49:06.835Z] Processing DSL script aqa-tests/buildenv/jenkins/testJobTemplate
[2025-03-05T21:49:06.859Z] Processing DSL script aqa-tests/buildenv/jenkins/testJobTemplate
[2025-03-05T21:49:06.908Z] Processing DSL script aqa-tests/buildenv/jenkins/testJobTemplate
[2025-03-05T21:50:07.916Z] LEVELS: [extended]
[2025-03-05T21:50:07.918Z] JDK_VERSIONS: [8]
[2025-03-05T21:50:07.918Z] GROUPS: [openjdk]
[2025-03-05T21:50:07.918Z] ARCH_OS_LIST: [aarch64_mac]
[2025-03-05T21:50:07.966Z] LEVELS: [extended]
[2025-03-05T21:50:07.968Z] JDK_VERSIONS: [8]
[2025-03-05T21:50:07.968Z] GROUPS: [openjdk]
[2025-03-05T21:50:07.968Z] ARCH_OS_LIST: [aarch64_mac]
[2025-03-05T21:50:08.042Z] LEVELS: [extended]
[2025-03-05T21:50:08.042Z] JDK_VERSIONS: [8]
[2025-03-05T21:50:08.042Z] GROUPS: [openjdk]
[2025-03-05T21:50:08.042Z] ARCH_OS_LIST: [aarch64_mac]
[2025-03-05T21:50:08.246Z] Existing items:
[2025-03-05T21:50:08.246Z] GeneratedJob{name='Test_openjdk11_hs_extended.openjdk_aarch64_mac_testList_0'}
[2025-03-05T21:50:08.246Z] GeneratedJob{name='Test_openjdk11_hs_extended.openjdk_aarch64_mac_testList_1'}
[2025-03-05T21:50:08.246Z] Unreferenced items:
[2025-03-05T21:50:08.246Z] GeneratedJob{name='Test_openjdk11_hs_extended.openjdk_aarch64_mac_rerun'}
[2025-03-05T21:50:08.246Z] GeneratedJob{name='Test_openjdk11_hs_extended.openjdk_aarch64_mac_testList_2'}
[2025-03-05T21:50:08.250Z] Existing items:
[2025-03-05T21:50:08.250Z] GeneratedJob{name='Test_openjdk11_hs_extended.openjdk_aarch64_mac_testList_0'}
[2025-03-05T21:50:08.250Z] GeneratedJob{name='Test_openjdk11_hs_extended.openjdk_aarch64_mac_testList_1'}
[2025-03-05T21:50:08.250Z] Unreferenced items:
[2025-03-05T21:50:08.250Z] GeneratedJob{name='Test_openjdk11_hs_extended.openjdk_aarch64_mac_rerun'}
[2025-03-05T21:50:08.250Z] GeneratedJob{name='Test_openjdk11_hs_extended.openjdk_aarch64_mac_testList_2'}
[2025-03-05T21:50:08.333Z] Existing items:
[2025-03-05T21:50:08.333Z] GeneratedJob{name='Test_openjdk11_hs_extended.openjdk_aarch64_mac_testList_0'}
[2025-03-05T21:50:08.333Z] GeneratedJob{name='Test_openjdk11_hs_extended.openjdk_aarch64_mac_testList_1'}
[2025-03-05T21:50:08.333Z] GeneratedJob{name='Test_openjdk11_hs_extended.openjdk_aarch64_mac_testList_2'}
[2025-03-05T21:50:08.333Z] Unreferenced items:
[2025-03-05T21:50:08.333Z] GeneratedJob{name='Test_openjdk11_hs_extended.openjdk_aarch64_mac_rerun'}
[Pipeline] }
[Pipeline] }
[Pipeline] }
[Pipeline] // parallel
[Pipeline] }
[Pipeline] // stage
[Pipeline] echo
[2025-03-05T21:51:35.246Z] PROCESSCATCH: Terminating any hung/left over test processes:
[Pipeline] sh
[2025-03-05T21:51:35.884Z] + aqa-tests/terminateTestProcesses.sh admin
[2025-03-05T21:51:35.884Z] Mac type machine.. do not terminate any remaining processes as Orka mac VMs are not process isolated, see: https://github.com/adoptium/aqa-tests/issues/4964
[Pipeline] cleanWs
[2025-03-05T21:51:36.074Z] [WS-CLEANUP] Deleting project workspace...
[2025-03-05T21:51:36.074Z] [WS-CLEANUP] Deferred wipeout is disabled by the job configuration...
[2025-03-05T21:51:36.867Z] [WS-CLEANUP] done
[Pipeline] sh
[2025-03-05T21:51:37.486Z] + find /cores -name '*core*' -print -exec rm -f '{}' ';'
[2025-03-05T21:51:37.486Z] /cores
[Pipeline] }
[Pipeline] // timeout
[Pipeline] timeout
[2025-03-05T21:51:37.649Z] Timeout set to expire in 5 min 0 sec
[Pipeline] {
[Pipeline] }
[Pipeline] // timeout
[Pipeline] }
[Pipeline] // node
[Pipeline] }
[Pipeline] // stage
[Pipeline] echo
[2025-03-05T21:51:37.800Z] SETUP_LABEL: ci.role.test
[Pipeline] stage
[Pipeline] { (Parallel Tests)
[Pipeline] parallel
[Pipeline] { (Branch: testList_0)
[Pipeline] { (Branch: testList_1)
[Pipeline] { (Branch: testList_2)
[Pipeline] build
[2025-03-05T21:51:37.854Z] Scheduling project: Test_openjdk11_hs_extended.openjdk_aarch64_mac_testList_0
[Pipeline] build
[2025-03-05T21:51:37.859Z] Scheduling project: Test_openjdk11_hs_extended.openjdk_aarch64_mac_testList_1
[Pipeline] build
[2025-03-05T21:51:37.865Z] Scheduling project: Test_openjdk11_hs_extended.openjdk_aarch64_mac_testList_2
[2025-03-05T21:51:43.640Z] Starting building: Test_openjdk11_hs_extended.openjdk_aarch64_mac_testList_2 #19
[2025-03-05T21:51:43.648Z] Starting building: Test_openjdk11_hs_extended.openjdk_aarch64_mac_testList_1 #34
[2025-03-05T21:51:43.657Z] Starting building: Test_openjdk11_hs_extended.openjdk_aarch64_mac_testList_0 #35
[2025-03-05T23:36:17.901Z] Build Test_openjdk11_hs_extended.openjdk_aarch64_mac_testList_2 #19 completed: SUCCESS
[Pipeline] }
[2025-03-05T23:46:59.297Z] Build Test_openjdk11_hs_extended.openjdk_aarch64_mac_testList_0 #35 completed: UNSTABLE
[Pipeline] }
[2025-03-05T23:47:58.359Z] Build Test_openjdk11_hs_extended.openjdk_aarch64_mac_testList_1 #34 completed: UNSTABLE
[Pipeline] }
[Pipeline] // parallel
[Pipeline] node
[2025-03-05T23:47:58.440Z] Running on test-docker-alpine319-armv8-2 in /home/jenkins/workspace/Test_openjdk11_hs_extended.openjdk_aarch64_mac
[Pipeline] {
[Pipeline] cleanWs
[2025-03-05T23:47:58.788Z] [WS-CLEANUP] Deleting project workspace...
[2025-03-05T23:47:58.788Z] [WS-CLEANUP] Deferred wipeout is disabled by the job configuration...
[2025-03-05T23:47:59.092Z] [WS-CLEANUP] done
[Pipeline] echo
[2025-03-05T23:47:59.104Z] Test_openjdk11_hs_extended.openjdk_aarch64_mac_testList_2 #19 completed with status SUCCESS
[Pipeline] timeout
[2025-03-05T23:47:59.106Z] Timeout set to expire in 1 hr 0 min
[Pipeline] {
[Pipeline] copyArtifacts
[2025-03-05T23:48:00.267Z] Copied 1 artifact from "Test_openjdk11_hs_extended.openjdk_aarch64_mac_testList_2" build number 19
[Pipeline] }
[Pipeline] // timeout
[Pipeline] step
[2025-03-05T23:48:00.451Z] TAP Reports Processing: START
[2025-03-05T23:48:00.452Z] Looking for TAP results report in workspace using pattern: Test_openjdk11_hs_extended.openjdk_aarch64_mac_testList_2/19/**/*.tap
[2025-03-05T23:48:00.638Z] Saving reports...
[2025-03-05T23:48:00.916Z] Processing '/home/jenkins/.jenkins/jobs/Test_openjdk11_hs_extended.openjdk_aarch64_mac/builds/137/tap-master-files/Test_openjdk11_hs_extended.openjdk_aarch64_mac_testList_2/19/aqa-tests/TKG/output_17412116085642/Test_openjdk11_hs_extended.openjdk_aarch64_mac_testList_2.tap'
[2025-03-05T23:48:00.916Z] Parsing TAP test result [/home/jenkins/.jenkins/jobs/Test_openjdk11_hs_extended.openjdk_aarch64_mac/builds/137/tap-master-files/Test_openjdk11_hs_extended.openjdk_aarch64_mac_testList_2/19/aqa-tests/TKG/output_17412116085642/Test_openjdk11_hs_extended.openjdk_aarch64_mac_testList_2.tap].
[2025-03-05T23:48:00.925Z] TAP Reports Processing: FINISH
[Pipeline] echo
[2025-03-05T23:48:00.937Z] Saving Test_openjdk11_hs_extended.openjdk_aarch64_mac_testList_2/19/**/*.tap file on jenkins.
[Pipeline] archiveArtifacts
[2025-03-05T23:48:01.094Z] Archiving artifacts
[2025-03-05T23:48:01.554Z] Recording fingerprints
[Pipeline] echo
[2025-03-05T23:48:01.754Z] Test_openjdk11_hs_extended.openjdk_aarch64_mac_testList_1 #34 completed with status UNSTABLE
[Pipeline] timeout
[2025-03-05T23:48:01.756Z] Timeout set to expire in 1 hr 0 min
[Pipeline] {
[Pipeline] copyArtifacts
[2025-03-05T23:48:02.759Z] Copied 1 artifact from "Test_openjdk11_hs_extended.openjdk_aarch64_mac_testList_1" build number 34
[Pipeline] }
[Pipeline] // timeout
[Pipeline] step
[2025-03-05T23:48:02.976Z] TAP Reports Processing: START
[2025-03-05T23:48:02.977Z] Looking for TAP results report in workspace using pattern: Test_openjdk11_hs_extended.openjdk_aarch64_mac_testList_1/34/**/*.tap
[2025-03-05T23:48:03.175Z] Saving reports...
[2025-03-05T23:48:03.332Z] Processing '/home/jenkins/.jenkins/jobs/Test_openjdk11_hs_extended.openjdk_aarch64_mac/builds/137/tap-master-files/Test_openjdk11_hs_extended.openjdk_aarch64_mac_testList_1/34/aqa-tests/TKG/output_17412116207327/Test_openjdk11_hs_extended.openjdk_aarch64_mac_testList_1.tap'
[2025-03-05T23:48:03.332Z] Parsing TAP test result [/home/jenkins/.jenkins/jobs/Test_openjdk11_hs_extended.openjdk_aarch64_mac/builds/137/tap-master-files/Test_openjdk11_hs_extended.openjdk_aarch64_mac_testList_1/34/aqa-tests/TKG/output_17412116207327/Test_openjdk11_hs_extended.openjdk_aarch64_mac_testList_1.tap].
[2025-03-05T23:48:03.335Z] There are failed test cases. Marking build as UNSTABLE
[2025-03-05T23:48:03.352Z] TAP Reports Processing: FINISH
[Pipeline] echo
[2025-03-05T23:48:03.362Z] Saving Test_openjdk11_hs_extended.openjdk_aarch64_mac_testList_1/34/**/*.tap file on jenkins.
[Pipeline] archiveArtifacts
[2025-03-05T23:48:03.510Z] Archiving artifacts
[2025-03-05T23:48:03.873Z] Recording fingerprints
[Pipeline] echo
[2025-03-05T23:48:04.058Z] Test_openjdk11_hs_extended.openjdk_aarch64_mac_testList_0 #35 completed with status UNSTABLE
[Pipeline] timeout
[2025-03-05T23:48:04.061Z] Timeout set to expire in 1 hr 0 min
[Pipeline] {
[Pipeline] copyArtifacts
[2025-03-05T23:48:05.053Z] Copied 1 artifact from "Test_openjdk11_hs_extended.openjdk_aarch64_mac_testList_0" build number 35
[Pipeline] }
[Pipeline] // timeout
[Pipeline] step
[2025-03-05T23:48:05.271Z] TAP Reports Processing: START
[2025-03-05T23:48:05.272Z] Looking for TAP results report in workspace using pattern: Test_openjdk11_hs_extended.openjdk_aarch64_mac_testList_0/35/**/*.tap
[2025-03-05T23:48:05.468Z] Saving reports...
[2025-03-05T23:48:05.625Z] Processing '/home/jenkins/.jenkins/jobs/Test_openjdk11_hs_extended.openjdk_aarch64_mac/builds/137/tap-master-files/Test_openjdk11_hs_extended.openjdk_aarch64_mac_testList_0/35/aqa-tests/TKG/output_17412116918167/Test_openjdk11_hs_extended.openjdk_aarch64_mac_testList_0.tap'
[2025-03-05T23:48:05.625Z] Parsing TAP test result [/home/jenkins/.jenkins/jobs/Test_openjdk11_hs_extended.openjdk_aarch64_mac/builds/137/tap-master-files/Test_openjdk11_hs_extended.openjdk_aarch64_mac_testList_0/35/aqa-tests/TKG/output_17412116918167/Test_openjdk11_hs_extended.openjdk_aarch64_mac_testList_0.tap].
[2025-03-05T23:48:05.628Z] There are failed test cases. Marking build as UNSTABLE
[2025-03-05T23:48:05.653Z] TAP Reports Processing: FINISH
[Pipeline] echo
[2025-03-05T23:48:05.664Z] Saving Test_openjdk11_hs_extended.openjdk_aarch64_mac_testList_0/35/**/*.tap file on jenkins.
[Pipeline] archiveArtifacts
[2025-03-05T23:48:05.844Z] Archiving artifacts
[2025-03-05T23:48:06.180Z] Recording fingerprints
[Pipeline] findFiles
[Pipeline] readFile
[Pipeline] findFiles
[Pipeline] echo
[2025-03-05T23:48:08.804Z] Tap file found: Test_openjdk11_hs_extended.openjdk_aarch64_mac_testList_2/19/aqa-tests/TKG/output_17412116085642/Test_openjdk11_hs_extended.openjdk_aarch64_mac_testList_2.tap...
[Pipeline] readFile
[Pipeline] findFiles
[Pipeline] echo
[2025-03-05T23:48:09.653Z] Tap file found: Test_openjdk11_hs_extended.openjdk_aarch64_mac_testList_1/34/aqa-tests/TKG/output_17412116207327/Test_openjdk11_hs_extended.openjdk_aarch64_mac_testList_1.tap...
[Pipeline] readFile
[Pipeline] findFiles
[Pipeline] echo
[2025-03-05T23:48:10.419Z] Tap file found: Test_openjdk11_hs_extended.openjdk_aarch64_mac_testList_0/35/aqa-tests/TKG/output_17412116918167/Test_openjdk11_hs_extended.openjdk_aarch64_mac_testList_0.tap...
[Pipeline] readFile
[Pipeline] echo
[2025-03-05T23:48:10.672Z] Rerun in Grinder with failed test targets: https://ci.adoptium.net/job/Grinder/parambuild/?SDK_RESOURCE=upstream&TARGET=testList+TESTLIST=jdk_security3_1,jdk_security3_0&BASE_DOCKER_REGISTRY_CREDENTIAL_ID=&TEST_FLAG=&UPSTREAM_TEST_JOB_NAME=&DOCKER_REQUIRED=false&ACTIVE_NODE_TIMEOUT=5&VENDOR_TEST_DIRS=&EXTRA_DOCKER_ARGS=&TKG_OWNER_BRANCH=adoptium%3Amaster&OPENJ9_SYSTEMTEST_OWNER_BRANCH=eclipse%3Amaster&PLATFORM=aarch64_mac&GENERATE_JOBS=true&KEEP_REPORTDIR=true&PERSONAL_BUILD=false&DOCKER_REGISTRY_DIR=&RERUN_ITERATIONS=0&ADOPTOPENJDK_REPO=https%3A%2F%2Fgithub.com%2Fadoptium%2Faqa-tests.git&SETUP_JCK_RUN=false&DOCKER_REGISTRY_URL_CREDENTIAL_ID=&LABEL=&EXTRA_OPTIONS=&CUSTOMIZED_SDK_URL=&BUILD_IDENTIFIER=&JENKINS_KEY=&ADOPTOPENJDK_BRANCH=master&LIGHT_WEIGHT_CHECKOUT=false&USE_JRE=false&ARTIFACTORY_SERVER=&KEEP_WORKSPACE=false&USER_CREDENTIALS_ID=&JDK_VERSION=11&DOCKER_REGISTRY_URL=&ITERATIONS=1&VENDOR_TEST_REPOS=&JDK_REPO=https%3A%2F%2Fgithub.com%2Fadoptium%2Fjdk11u&JCK_GIT_BRANCH=master&OPENJ9_BRANCH=master&OPENJ9_SHA=&JCK_GIT_REPO=&VENDOR_TEST_BRANCHES=&UPSTREAM_JOB_NAME=build-scripts%2Fjobs%2Fjdk11u%2Fjdk11u-mac-aarch64-temurin&OPENJ9_REPO=https%3A%2F%2Fgithub.com%2Feclipse-openj9%2Fopenj9.git&CLOUD_PROVIDER=&CUSTOM_TARGET=&VENDOR_TEST_SHAS=&JDK_BRANCH=jdk-11.0.27%2B4_adopt&LABEL_ADDITION=&ARTIFACTORY_REPO=&ARTIFACTORY_ROOT_DIR=&UPSTREAM_TEST_JOB_NUMBER=&DOCKERIMAGE_TAG=&TEST_TIME=120&JDK_IMPL=hotspot&SSH_AGENT_CREDENTIAL=&AUTO_DETECT=true&SLACK_CHANNEL=aqavit-bot&DYNAMIC_COMPILE=false&RELATED_NODES=&ADOPTOPENJDK_SYSTEMTEST_OWNER_BRANCH=adoptium%3Amaster&APPLICATION_OPTIONS=&CUSTOMIZED_SDK_URL_CREDENTIAL_ID=eclipse_temurin_bot_email_and_token&ARCHIVE_TEST_RESULTS=false&NUM_MACHINES=&OPENJDK_SHA=&TRSS_URL=&RERUN_FAILURE=false&USE_TESTENV_PROPERTIES=false&BUILD_LIST=openjdk&ADDITIONAL_ARTIFACTS_REQUIRED=&UPSTREAM_JOB_NUMBER=371&STF_OWNER_BRANCH=adoptium%3Amaster&TIME_LIMIT=25&JVM_OPTIONS=&PARALLEL=None
[Pipeline] echo
[2025-03-05T23:48:10.774Z] Rerun failed jdk test cases in Grinder with jdk_custom target: https://ci.adoptium.net/job/Grinder/parambuild/?SDK_RESOURCE=upstream&TARGET=jdk_custom&BASE_DOCKER_REGISTRY_CREDENTIAL_ID=&TEST_FLAG=&UPSTREAM_TEST_JOB_NAME=&DOCKER_REQUIRED=false&ACTIVE_NODE_TIMEOUT=5&VENDOR_TEST_DIRS=&EXTRA_DOCKER_ARGS=&TKG_OWNER_BRANCH=adoptium%3Amaster&OPENJ9_SYSTEMTEST_OWNER_BRANCH=eclipse%3Amaster&PLATFORM=aarch64_mac&GENERATE_JOBS=true&KEEP_REPORTDIR=true&PERSONAL_BUILD=false&DOCKER_REGISTRY_DIR=&RERUN_ITERATIONS=0&ADOPTOPENJDK_REPO=https%3A%2F%2Fgithub.com%2Fadoptium%2Faqa-tests.git&SETUP_JCK_RUN=false&DOCKER_REGISTRY_URL_CREDENTIAL_ID=&LABEL=&EXTRA_OPTIONS=&CUSTOMIZED_SDK_URL=&BUILD_IDENTIFIER=&JENKINS_KEY=&ADOPTOPENJDK_BRANCH=master&LIGHT_WEIGHT_CHECKOUT=false&USE_JRE=false&ARTIFACTORY_SERVER=&KEEP_WORKSPACE=false&USER_CREDENTIALS_ID=&JDK_VERSION=11&DOCKER_REGISTRY_URL=&ITERATIONS=1&VENDOR_TEST_REPOS=&JDK_REPO=https%3A%2F%2Fgithub.com%2Fadoptium%2Fjdk11u&JCK_GIT_BRANCH=master&OPENJ9_BRANCH=master&OPENJ9_SHA=&JCK_GIT_REPO=&VENDOR_TEST_BRANCHES=&UPSTREAM_JOB_NAME=build-scripts%2Fjobs%2Fjdk11u%2Fjdk11u-mac-aarch64-temurin&OPENJ9_REPO=https%3A%2F%2Fgithub.com%2Feclipse-openj9%2Fopenj9.git&CLOUD_PROVIDER=&CUSTOM_TARGET=sun%2Fsecurity%2Fssl%2FX509TrustManagerImpl%2Fdistrust%2FCamerfirma.java+sun%2Fsecurity%2Fssl%2FX509TrustManagerImpl%2Fdistrust%2FEntrust.java+sun%2Fsecurity%2Fssl%2FX509TrustManagerImpl%2Fdistrust%2FSymantec.java&VENDOR_TEST_SHAS=&JDK_BRANCH=jdk-11.0.27%2B4_adopt&LABEL_ADDITION=&ARTIFACTORY_REPO=&ARTIFACTORY_ROOT_DIR=&UPSTREAM_TEST_JOB_NUMBER=&DOCKERIMAGE_TAG=&TEST_TIME=120&JDK_IMPL=hotspot&SSH_AGENT_CREDENTIAL=&AUTO_DETECT=true&SLACK_CHANNEL=aqavit-bot&DYNAMIC_COMPILE=false&RELATED_NODES=&ADOPTOPENJDK_SYSTEMTEST_OWNER_BRANCH=adoptium%3Amaster&APPLICATION_OPTIONS=&CUSTOMIZED_SDK_URL_CREDENTIAL_ID=eclipse_temurin_bot_email_and_token&ARCHIVE_TEST_RESULTS=false&NUM_MACHINES=&OPENJDK_SHA=&TRSS_URL=&RERUN_FAILURE=false&USE_TESTENV_PROPERTIES=false&BUILD_LIST=openjdk&ADDITIONAL_ARTIFACTS_REQUIRED=&UPSTREAM_JOB_NUMBER=371&STF_OWNER_BRANCH=adoptium%3Amaster&TIME_LIMIT=25&JVM_OPTIONS=&PARALLEL=None
[Pipeline] cleanWs
[2025-03-05T23:48:11.127Z] [WS-CLEANUP] Deleting project workspace...
[2025-03-05T23:48:11.127Z] [WS-CLEANUP] Deferred wipeout is disabled by the job configuration...
[2025-03-05T23:48:11.357Z] [WS-CLEANUP] done
[Pipeline] }
[Pipeline] // node
[Pipeline] }
[Pipeline] // stage
[Pipeline] stage
[Pipeline] { (Rerun)
[Pipeline] echo
[2025-03-05T23:48:11.503Z] allocate a node for generating rerun job ...
[Pipeline] node
[2025-03-05T23:48:11.518Z] Running on test-osuosl-centos74-ppc64le-1 in /home/jenkins/workspace/Test_openjdk11_hs_extended.openjdk_aarch64_mac
[Pipeline] {
[Pipeline] echo
[2025-03-05T23:48:11.555Z] Generating rerun Test_openjdk11_hs_extended.openjdk_aarch64_mac_rerun job for running failed test(s) ...
[Pipeline] parallel
[Pipeline] { (Branch: Test_openjdk11_hs_extended.openjdk_aarch64_mac_rerun)
[Pipeline] echo
[2025-03-05T23:48:11.611Z] GENERATE_JOBS is set to true, set test job Test_openjdk11_hs_extended.openjdk_aarch64_mac_rerun params for generating the job
[Pipeline] fileExists
[Pipeline] sh
[2025-03-05T23:48:13.871Z] + curl -Os https://raw.githubusercontent.com/adoptium/aqa-tests/master/buildenv/jenkins/testJobTemplate
[Pipeline] jobDsl
[2025-03-05T23:48:15.340Z] Processing DSL script testJobTemplate
[2025-03-05T23:53:01.133Z] LEVELS: [extended]
[2025-03-05T23:53:01.133Z] JDK_VERSIONS: [8]
[2025-03-05T23:53:01.133Z] GROUPS: [openjdk]
[2025-03-05T23:53:01.133Z] ARCH_OS_LIST: [aarch64_mac]
[2025-03-05T23:53:01.363Z] Existing items:
[2025-03-05T23:53:01.363Z] GeneratedJob{name='Test_openjdk11_hs_extended.openjdk_aarch64_mac_rerun'}
[2025-03-05T23:53:01.363Z] GeneratedJob{name='Test_openjdk11_hs_extended.openjdk_aarch64_mac_testList_0'}
[2025-03-05T23:53:01.363Z] GeneratedJob{name='Test_openjdk11_hs_extended.openjdk_aarch64_mac_testList_1'}
[2025-03-05T23:53:01.363Z] GeneratedJob{name='Test_openjdk11_hs_extended.openjdk_aarch64_mac_testList_2'}
[Pipeline] }
[Pipeline] // parallel
[Pipeline] }
[Pipeline] // node
[Pipeline] echo
[2025-03-05T23:54:06.958Z] Triggering rerun jobs in parallel ...
[Pipeline] parallel
[Pipeline] { (Branch: Test_openjdk11_hs_extended.openjdk_aarch64_mac_rerun)
[Pipeline] build
[2025-03-05T23:54:06.979Z] Scheduling project: Test_openjdk11_hs_extended.openjdk_aarch64_mac_rerun
[2025-03-05T23:54:15.823Z] Starting building: Test_openjdk11_hs_extended.openjdk_aarch64_mac_rerun #17
[2025-03-05T23:57:21.791Z] Build Test_openjdk11_hs_extended.openjdk_aarch64_mac_rerun #17 completed: UNSTABLE
[Pipeline] }
[Pipeline] // parallel
[Pipeline] node
[2025-03-05T23:57:21.891Z] Running on test-osuosl-ubuntu2404-ppc64le-2 in /home/jenkins/workspace/Test_openjdk11_hs_extended.openjdk_aarch64_mac
[Pipeline] {
[Pipeline] cleanWs
[2025-03-05T23:57:22.279Z] [WS-CLEANUP] Deleting project workspace...
[2025-03-05T23:57:22.279Z] [WS-CLEANUP] Deferred wipeout is disabled by the job configuration...
[2025-03-05T23:57:22.457Z] [WS-CLEANUP] done
[Pipeline] echo
[2025-03-05T23:57:22.467Z] Test_openjdk11_hs_extended.openjdk_aarch64_mac_rerun #17 completed with status UNSTABLE
[Pipeline] timeout
[2025-03-05T23:57:22.470Z] Timeout set to expire in 1 hr 0 min
[Pipeline] {
[Pipeline] copyArtifacts
[2025-03-05T23:57:23.576Z] Copied 1 artifact from "Test_openjdk11_hs_extended.openjdk_aarch64_mac_rerun" build number 17
[Pipeline] }
[Pipeline] // timeout
[Pipeline] step
[2025-03-05T23:57:23.822Z] TAP Reports Processing: START
[2025-03-05T23:57:23.822Z] Looking for TAP results report in workspace using pattern: Test_openjdk11_hs_extended.openjdk_aarch64_mac_rerun/17/**/*.tap
[2025-03-05T23:57:24.000Z] Saving reports...
[2025-03-05T23:57:24.183Z] Processing '/home/jenkins/.jenkins/jobs/Test_openjdk11_hs_extended.openjdk_aarch64_mac/builds/137/tap-master-files/Test_openjdk11_hs_extended.openjdk_aarch64_mac_rerun/17/aqa-tests/TKG/output_17412190153223/Test_openjdk11_hs_extended.openjdk_aarch64_mac_rerun.tap'
[2025-03-05T23:57:24.184Z] Parsing TAP test result [/home/jenkins/.jenkins/jobs/Test_openjdk11_hs_extended.openjdk_aarch64_mac/builds/137/tap-master-files/Test_openjdk11_hs_extended.openjdk_aarch64_mac_rerun/17/aqa-tests/TKG/output_17412190153223/Test_openjdk11_hs_extended.openjdk_aarch64_mac_rerun.tap].
[2025-03-05T23:57:24.186Z] There are failed test cases. Marking build as UNSTABLE
[2025-03-05T23:57:24.210Z] TAP Reports Processing: FINISH
[Pipeline] echo
[2025-03-05T23:57:24.216Z] Saving Test_openjdk11_hs_extended.openjdk_aarch64_mac_rerun/17/**/*.tap file on jenkins.
[Pipeline] archiveArtifacts
[2025-03-05T23:57:24.399Z] Archiving artifacts
[2025-03-05T23:57:24.758Z] Recording fingerprints
[Pipeline] findFiles
[Pipeline] readFile
[Pipeline] cleanWs
[2025-03-05T23:57:26.268Z] [WS-CLEANUP] Deleting project workspace...
[2025-03-05T23:57:26.268Z] [WS-CLEANUP] Deferred wipeout is disabled by the job configuration...
[2025-03-05T23:57:26.447Z] [WS-CLEANUP] done
[Pipeline] }
[Pipeline] // node
[Pipeline] }
[Pipeline] // stage
[Pipeline] }
[Pipeline] // timestamps
[Pipeline] End of Pipeline
/home/jenkins/.jenkins/workspace/Test_openjdk11_hs_extended.openjdk_aarch64_mac@tmp/jfrog/137/.jfrog deleted
Finished: UNSTABLE