jdk_security3_1
[2024-11-21T02:32:51.706Z] Running test jdk_security3_1 ...
[2024-11-21T02:32:51.706Z] ===============================================
[2024-11-21T02:32:51.706Z] jdk_security3_1 Start Time: Thu Nov 21 02:32:51 2024 Epoch Time (ms): 1732156371162
[2024-11-21T02:32:51.706Z] variation: Mode650
[2024-11-21T02:32:51.706Z] JVM_OPTIONS: -XX:-UseCompressedOops
[2024-11-21T02:32:51.706Z] { \
[2024-11-21T02:32:51.706Z] echo ""; echo "TEST SETUP:"; \
[2024-11-21T02:32:51.706Z] echo "Nothing to be done for setup."; \
[2024-11-21T02:32:51.706Z] mkdir -p "/home/jenkins/workspace/Test_openjdk17_hs_extended.openjdk_aarch64_linux_testList_0/aqa-tests/TKG/../TKG/output_17321563695498/jdk_security3_1"; \
[2024-11-21T02:32:51.706Z] cd "/home/jenkins/workspace/Test_openjdk17_hs_extended.openjdk_aarch64_linux_testList_0/aqa-tests/TKG/../TKG/output_17321563695498/jdk_security3_1"; \
[2024-11-21T02:32:51.706Z] echo ""; echo "TESTING:"; \
[2024-11-21T02:32:51.706Z] "/home/jenkins/workspace/Test_openjdk17_hs_extended.openjdk_aarch64_linux_testList_0/jdkbinary/j2sdk-image/bin/java" -Xmx512m -jar "/home/jenkins/workspace/Test_openjdk17_hs_extended.openjdk_aarch64_linux_testList_0/aqa-tests/TKG/../../jvmtest/openjdk/jtreg/lib/jtreg.jar" \
[2024-11-21T02:32:51.706Z] -agentvm -a -ea -esa -v:fail,error,time,nopass -retain:fail,error,*.dmp,javacore.*,heapdump.*,*.trc -ignore:quiet -timeoutFactor:8 -xml:verify -concurrency:3 -nativepath:"/home/jenkins/workspace/Test_openjdk17_hs_extended.openjdk_aarch64_linux_testList_0/jdkbinary/openjdk-test-image/jdk/jtreg/native" -vmoptions:"-Xmx512m -XX:-UseCompressedOops " \
[2024-11-21T02:32:51.706Z] \
[2024-11-21T02:32:51.706Z] -w ""/home/jenkins/workspace/Test_openjdk17_hs_extended.openjdk_aarch64_linux_testList_0/aqa-tests/TKG/../TKG/output_17321563695498/jdk_security3_1"/work" \
[2024-11-21T02:32:51.706Z] -r ""/home/jenkins/workspace/Test_openjdk17_hs_extended.openjdk_aarch64_linux_testList_0/aqa-tests/TKG/../TKG/output_17321563695498/jdk_security3_1"/report" \
[2024-11-21T02:32:51.706Z] -jdk:"/home/jenkins/workspace/Test_openjdk17_hs_extended.openjdk_aarch64_linux_testList_0/jdkbinary/j2sdk-image" \
[2024-11-21T02:32:51.706Z] -exclude:"/home/jenkins/workspace/Test_openjdk17_hs_extended.openjdk_aarch64_linux_testList_0/aqa-tests/TKG/../openjdk/openjdk-jdk/test/jdk/ProblemList.txt" \
[2024-11-21T02:32:51.706Z] -exclude:"/home/jenkins/workspace/Test_openjdk17_hs_extended.openjdk_aarch64_linux_testList_0/aqa-tests/TKG/../../jvmtest/openjdk/excludes/ProblemList_openjdk17.txt" \
[2024-11-21T02:32:51.706Z] \
[2024-11-21T02:32:51.706Z] -exclude:"/home/jenkins/workspace/Test_openjdk17_hs_extended.openjdk_aarch64_linux_testList_0/aqa-tests/TKG/../openjdk/excludes/vendors/eclipse/ProblemList_openjdk17.txt" \
[2024-11-21T02:32:51.706Z] "/home/jenkins/workspace/Test_openjdk17_hs_extended.openjdk_aarch64_linux_testList_0/aqa-tests/TKG/../openjdk/openjdk-jdk/test/jdk:jdk_security3"; \
[2024-11-21T02:32:51.706Z] if [ $? -eq 0 ]; then echo "-----------------------------------"; echo "jdk_security3_1""_PASSED"; echo "-----------------------------------"; cd /home/jenkins/workspace/Test_openjdk17_hs_extended.openjdk_aarch64_linux_testList_0/aqa-tests/TKG/..; else echo "-----------------------------------"; echo "jdk_security3_1""_FAILED"; echo "-----------------------------------"; fi; \
[2024-11-21T02:32:51.706Z] echo ""; echo "TEST TEARDOWN:"; \
[2024-11-21T02:32:51.706Z] echo "Nothing to be done for teardown."; \
[2024-11-21T02:32:51.706Z] } 2>&1 | tee -a "/home/jenkins/workspace/Test_openjdk17_hs_extended.openjdk_aarch64_linux_testList_0/aqa-tests/TKG/../TKG/output_17321563695498/TestTargetResult";
[2024-11-21T02:32:51.706Z]
[2024-11-21T02:32:51.706Z] TEST SETUP:
[2024-11-21T02:32:51.706Z] Nothing to be done for setup.
[2024-11-21T02:32:51.706Z]
[2024-11-21T02:32:51.706Z] TESTING:
[2024-11-21T02:32:55.202Z] Directory "/home/jenkins/workspace/Test_openjdk17_hs_extended.openjdk_aarch64_linux_testList_0/aqa-tests/TKG/../TKG/output_17321563695498/jdk_security3_1/work" not found: creating
[2024-11-21T02:32:55.202Z] Directory "/home/jenkins/workspace/Test_openjdk17_hs_extended.openjdk_aarch64_linux_testList_0/aqa-tests/TKG/../TKG/output_17321563695498/jdk_security3_1/report" not found: creating
[2024-11-21T02:33:44.883Z] XML output with verification to /home/jenkins/workspace/Test_openjdk17_hs_extended.openjdk_aarch64_linux_testList_0/aqa-tests/TKG/output_17321563695498/jdk_security3_1/work
[2024-11-21T03:55:50.045Z] --------------------------------------------------
[2024-11-21T03:55:50.045Z] TEST: sun/security/ec/ed/EdDSATest.java
[2024-11-21T03:55:50.045Z] TEST JDK: /home/jenkins/workspace/Test_openjdk17_hs_extended.openjdk_aarch64_linux_testList_0/jdkbinary/j2sdk-image
[2024-11-21T03:55:50.045Z]
[2024-11-21T03:55:50.045Z] ACTION: build -- Passed. All files up to date
[2024-11-21T03:55:50.045Z] REASON: User specified action: run build jdk.test.lib.Convert
[2024-11-21T03:55:50.045Z] TIME: 0.0 seconds
[2024-11-21T03:55:50.045Z] messages:
[2024-11-21T03:55:50.045Z] command: build jdk.test.lib.Convert
[2024-11-21T03:55:50.045Z] reason: User specified action: run build jdk.test.lib.Convert
[2024-11-21T03:55:50.045Z] started: Thu Nov 21 03:39:39 UTC 2024
[2024-11-21T03:55:50.045Z] finished: Thu Nov 21 03:39:39 UTC 2024
[2024-11-21T03:55:50.045Z] elapsed time (seconds): 0.0
[2024-11-21T03:55:50.045Z]
[2024-11-21T03:55:50.045Z] ACTION: build -- Passed. Build successful
[2024-11-21T03:55:50.045Z] REASON: Named class compiled on demand
[2024-11-21T03:55:50.045Z] TIME: 1.341 seconds
[2024-11-21T03:55:50.045Z] messages:
[2024-11-21T03:55:50.045Z] command: build EdDSATest
[2024-11-21T03:55:50.045Z] reason: Named class compiled on demand
[2024-11-21T03:55:50.045Z] started: Thu Nov 21 03:39:39 UTC 2024
[2024-11-21T03:55:50.045Z] Test directory:
[2024-11-21T03:55:50.045Z] compile: EdDSATest
[2024-11-21T03:55:50.045Z] finished: Thu Nov 21 03:39:40 UTC 2024
[2024-11-21T03:55:50.045Z] elapsed time (seconds): 1.341
[2024-11-21T03:55:50.045Z]
[2024-11-21T03:55:50.045Z] ACTION: compile -- Passed. Compilation successful
[2024-11-21T03:55:50.045Z] REASON: .class file out of date or does not exist
[2024-11-21T03:55:50.045Z] TIME: 1.341 seconds
[2024-11-21T03:55:50.045Z] messages:
[2024-11-21T03:55:50.045Z] command: compile /home/jenkins/workspace/Test_openjdk17_hs_extended.openjdk_aarch64_linux_testList_0/aqa-tests/openjdk/openjdk-jdk/test/jdk/sun/security/ec/ed/EdDSATest.java
[2024-11-21T03:55:50.045Z] reason: .class file out of date or does not exist
[2024-11-21T03:55:50.045Z] started: Thu Nov 21 03:39:39 UTC 2024
[2024-11-21T03:55:50.045Z] Mode: agentvm
[2024-11-21T03:55:50.045Z] Agent id: 1
[2024-11-21T03:55:50.045Z] finished: Thu Nov 21 03:39:40 UTC 2024
[2024-11-21T03:55:50.045Z] elapsed time (seconds): 1.341
[2024-11-21T03:55:50.045Z] configuration:
[2024-11-21T03:55:50.045Z] Boot Layer (javac runtime environment)
[2024-11-21T03:55:50.045Z] class path: /home/jenkins/workspace/Test_openjdk17_hs_extended.openjdk_aarch64_linux_testList_0/jvmtest/openjdk/jtreg/lib/javatest.jar
[2024-11-21T03:55:50.045Z] /home/jenkins/workspace/Test_openjdk17_hs_extended.openjdk_aarch64_linux_testList_0/jvmtest/openjdk/jtreg/lib/jtreg.jar
[2024-11-21T03:55:50.045Z] patch: java.base /home/jenkins/workspace/Test_openjdk17_hs_extended.openjdk_aarch64_linux_testList_0/aqa-tests/TKG/output_17321563695498/jdk_security3_1/work/patches/java.base
[2024-11-21T03:55:50.045Z]
[2024-11-21T03:55:50.045Z] javac compilation environment
[2024-11-21T03:55:50.045Z] source path: /home/jenkins/workspace/Test_openjdk17_hs_extended.openjdk_aarch64_linux_testList_0/aqa-tests/openjdk/openjdk-jdk/test/jdk/sun/security/ec/ed
[2024-11-21T03:55:50.045Z] /home/jenkins/workspace/Test_openjdk17_hs_extended.openjdk_aarch64_linux_testList_0/aqa-tests/openjdk/openjdk-jdk/test/lib
[2024-11-21T03:55:50.045Z] class path: /home/jenkins/workspace/Test_openjdk17_hs_extended.openjdk_aarch64_linux_testList_0/aqa-tests/openjdk/openjdk-jdk/test/jdk/sun/security/ec/ed
[2024-11-21T03:55:50.045Z] /home/jenkins/workspace/Test_openjdk17_hs_extended.openjdk_aarch64_linux_testList_0/aqa-tests/TKG/output_17321563695498/jdk_security3_1/work/classes/1/sun/security/ec/ed/EdDSATest.d
[2024-11-21T03:55:50.045Z] /home/jenkins/workspace/Test_openjdk17_hs_extended.openjdk_aarch64_linux_testList_0/aqa-tests/TKG/output_17321563695498/jdk_security3_1/work/classes/1/test/lib
[2024-11-21T03:55:50.045Z]
[2024-11-21T03:55:50.045Z] rerun:
[2024-11-21T03:55:50.045Z] cd /home/jenkins/workspace/Test_openjdk17_hs_extended.openjdk_aarch64_linux_testList_0/aqa-tests/TKG/output_17321563695498/jdk_security3_1/work/scratch/1 && \
[2024-11-21T03:55:50.045Z] DISPLAY=:0 \
[2024-11-21T03:55:50.045Z] HOME=/home/jenkins \
[2024-11-21T03:55:50.045Z] LANG=C.utf8 \
[2024-11-21T03:55:50.045Z] PATH=/bin:/usr/bin:/usr/sbin \
[2024-11-21T03:55:50.045Z] /home/jenkins/workspace/Test_openjdk17_hs_extended.openjdk_aarch64_linux_testList_0/jdkbinary/j2sdk-image/bin/javac \
[2024-11-21T03:55:50.045Z] -J-ea \
[2024-11-21T03:55:50.045Z] -J-esa \
[2024-11-21T03:55:50.045Z] -J-Xmx512m \
[2024-11-21T03:55:50.046Z] -J-XX:-UseCompressedOops \
[2024-11-21T03:55:50.046Z] -J-Dtest.vm.opts='-ea -esa -Xmx512m -XX:-UseCompressedOops' \
[2024-11-21T03:55:50.046Z] -J-Dtest.tool.vm.opts='-J-ea -J-esa -J-Xmx512m -J-XX:-UseCompressedOops' \
[2024-11-21T03:55:50.046Z] -J-Dtest.compiler.opts= \
[2024-11-21T03:55:50.046Z] -J-Dtest.java.opts= \
[2024-11-21T03:55:50.046Z] -J-Dtest.jdk=/home/jenkins/workspace/Test_openjdk17_hs_extended.openjdk_aarch64_linux_testList_0/jdkbinary/j2sdk-image \
[2024-11-21T03:55:50.046Z] -J-Dcompile.jdk=/home/jenkins/workspace/Test_openjdk17_hs_extended.openjdk_aarch64_linux_testList_0/jdkbinary/j2sdk-image \
[2024-11-21T03:55:50.046Z] -J-Dtest.timeout.factor=8.0 \
[2024-11-21T03:55:50.046Z] -J-Dtest.nativepath=/home/jenkins/workspace/Test_openjdk17_hs_extended.openjdk_aarch64_linux_testList_0/jdkbinary/openjdk-test-image/jdk/jtreg/native \
[2024-11-21T03:55:50.046Z] -J-Dtest.root=/home/jenkins/workspace/Test_openjdk17_hs_extended.openjdk_aarch64_linux_testList_0/aqa-tests/openjdk/openjdk-jdk/test/jdk \
[2024-11-21T03:55:50.046Z] -J-Dtest.name=sun/security/ec/ed/EdDSATest.java \
[2024-11-21T03:55:50.046Z] -J-Dtest.file=/home/jenkins/workspace/Test_openjdk17_hs_extended.openjdk_aarch64_linux_testList_0/aqa-tests/openjdk/openjdk-jdk/test/jdk/sun/security/ec/ed/EdDSATest.java \
[2024-11-21T03:55:50.046Z] -J-Dtest.src=/home/jenkins/workspace/Test_openjdk17_hs_extended.openjdk_aarch64_linux_testList_0/aqa-tests/openjdk/openjdk-jdk/test/jdk/sun/security/ec/ed \
[2024-11-21T03:55:50.046Z] -J-Dtest.src.path=/home/jenkins/workspace/Test_openjdk17_hs_extended.openjdk_aarch64_linux_testList_0/aqa-tests/openjdk/openjdk-jdk/test/jdk/sun/security/ec/ed:/home/jenkins/workspace/Test_openjdk17_hs_extended.openjdk_aarch64_linux_testList_0/aqa-tests/openjdk/openjdk-jdk/test/lib \
[2024-11-21T03:55:50.046Z] -J-Dtest.classes=/home/jenkins/workspace/Test_openjdk17_hs_extended.openjdk_aarch64_linux_testList_0/aqa-tests/TKG/output_17321563695498/jdk_security3_1/work/classes/1/sun/security/ec/ed/EdDSATest.d \
[2024-11-21T03:55:50.046Z] -J-Dtest.class.path=/home/jenkins/workspace/Test_openjdk17_hs_extended.openjdk_aarch64_linux_testList_0/aqa-tests/TKG/output_17321563695498/jdk_security3_1/work/classes/1/sun/security/ec/ed/EdDSATest.d:/home/jenkins/workspace/Test_openjdk17_hs_extended.openjdk_aarch64_linux_testList_0/aqa-tests/TKG/output_17321563695498/jdk_security3_1/work/classes/1/test/lib \
[2024-11-21T03:55:50.046Z] -J-Dtest.class.path.prefix=/home/jenkins/workspace/Test_openjdk17_hs_extended.openjdk_aarch64_linux_testList_0/aqa-tests/TKG/output_17321563695498/jdk_security3_1/work/classes/1/sun/security/ec/ed/EdDSATest.d:/home/jenkins/workspace/Test_openjdk17_hs_extended.openjdk_aarch64_linux_testList_0/aqa-tests/openjdk/openjdk-jdk/test/jdk/sun/security/ec/ed:/home/jenkins/workspace/Test_openjdk17_hs_extended.openjdk_aarch64_linux_testList_0/aqa-tests/TKG/output_17321563695498/jdk_security3_1/work/classes/1/test/lib \
[2024-11-21T03:55:50.046Z] -d /home/jenkins/workspace/Test_openjdk17_hs_extended.openjdk_aarch64_linux_testList_0/aqa-tests/TKG/output_17321563695498/jdk_security3_1/work/classes/1/sun/security/ec/ed/EdDSATest.d \
[2024-11-21T03:55:50.046Z] -sourcepath /home/jenkins/workspace/Test_openjdk17_hs_extended.openjdk_aarch64_linux_testList_0/aqa-tests/openjdk/openjdk-jdk/test/jdk/sun/security/ec/ed:/home/jenkins/workspace/Test_openjdk17_hs_extended.openjdk_aarch64_linux_testList_0/aqa-tests/openjdk/openjdk-jdk/test/lib \
[2024-11-21T03:55:50.046Z] -classpath /home/jenkins/workspace/Test_openjdk17_hs_extended.openjdk_aarch64_linux_testList_0/aqa-tests/openjdk/openjdk-jdk/test/jdk/sun/security/ec/ed:/home/jenkins/workspace/Test_openjdk17_hs_extended.openjdk_aarch64_linux_testList_0/aqa-tests/TKG/output_17321563695498/jdk_security3_1/work/classes/1/sun/security/ec/ed/EdDSATest.d:/home/jenkins/workspace/Test_openjdk17_hs_extended.openjdk_aarch64_linux_testList_0/aqa-tests/TKG/output_17321563695498/jdk_security3_1/work/classes/1/test/lib /home/jenkins/workspace/Test_openjdk17_hs_extended.openjdk_aarch64_linux_testList_0/aqa-tests/openjdk/openjdk-jdk/test/jdk/sun/security/ec/ed/EdDSATest.java
[2024-11-21T03:55:50.046Z] direct:
[2024-11-21T03:55:50.046Z] Note: /home/jenkins/workspace/Test_openjdk17_hs_extended.openjdk_aarch64_linux_testList_0/aqa-tests/openjdk/openjdk-jdk/test/jdk/sun/security/ec/ed/EdDSATest.java uses unchecked or unsafe operations.
[2024-11-21T03:55:50.046Z] Note: Recompile with -Xlint:unchecked for details.
[2024-11-21T03:55:50.046Z]
[2024-11-21T03:55:50.046Z] ACTION: main -- Error. Agent error: java.lang.Exception: Agent 22 timed out with a timeout of 960 seconds; check console log for any additional details
[2024-11-21T03:55:50.046Z] REASON: User specified action: run main EdDSATest
[2024-11-21T03:55:50.046Z] TIME: 965.193 seconds
[2024-11-21T03:55:50.046Z] messages:
[2024-11-21T03:55:50.046Z] command: main EdDSATest
[2024-11-21T03:55:50.046Z] reason: User specified action: run main EdDSATest
[2024-11-21T03:55:50.046Z] started: Thu Nov 21 03:39:40 UTC 2024
[2024-11-21T03:55:50.046Z] Mode: agentvm
[2024-11-21T03:55:50.046Z] Agent id: 22
[2024-11-21T03:55:50.046Z] Timeout signalled after 960 seconds
[2024-11-21T03:55:50.046Z] Timeout information:
[2024-11-21T03:55:50.046Z] Running jstack on process 729144
[2024-11-21T03:55:50.046Z] 2024-11-21 03:55:45
[2024-11-21T03:55:50.046Z] Full thread dump OpenJDK 64-Bit Server VM (17.0.14-beta+4-ea mixed mode):
[2024-11-21T03:55:50.046Z]
[2024-11-21T03:55:50.046Z] Threads class SMR info:
[2024-11-21T03:55:50.046Z] _java_thread_list=0x0000ffff3c001990, length=14, elements={
[2024-11-21T03:55:50.046Z] 0x0000ffff9c0298f0, 0x0000ffff9c139890, 0x0000ffff9c13af40, 0x0000ffff9c173620,
[2024-11-21T03:55:50.046Z] 0x0000ffff9c168350, 0x0000ffff9c1692f0, 0x0000ffff9c16ac60, 0x0000ffff9c16c1c0,
[2024-11-21T03:55:50.046Z] 0x0000ffff9c16d680, 0x0000ffff9c1af270, 0x0000ffff9c2429b0, 0x0000ffff9c305d10,
[2024-11-21T03:55:50.046Z] 0x0000ffff9c380f40, 0x0000ffff3c000f80
[2024-11-21T03:55:50.046Z] }
[2024-11-21T03:55:50.046Z]
[2024-11-21T03:55:50.046Z] "main" #1 prio=5 os_prio=0 cpu=394.69ms elapsed=981.21s tid=0x0000ffff9c0298f0 nid=0xb203b in Object.wait() [0x0000ffffa0823000]
[2024-11-21T03:55:50.046Z] java.lang.Thread.State: WAITING (on object monitor)
[2024-11-21T03:55:50.046Z] at java.lang.Object.wait(java.base@17.0.14-beta/Native Method)
[2024-11-21T03:55:50.046Z] - waiting on <0x0000ffff656b3400> (a java.lang.Thread)
[2024-11-21T03:55:50.046Z] at java.lang.Thread.join(java.base@17.0.14-beta/Thread.java:1313)
[2024-11-21T03:55:50.046Z] - locked <0x0000ffff656b3400> (a java.lang.Thread)
[2024-11-21T03:55:50.046Z] at java.lang.Thread.join(java.base@17.0.14-beta/Thread.java:1381)
[2024-11-21T03:55:50.046Z] at com.sun.javatest.regtest.agent.MainActionHelper.runClass(MainActionHelper.java:219)
[2024-11-21T03:55:50.046Z] at com.sun.javatest.regtest.agent.AgentServer.doMain(AgentServer.java:317)
[2024-11-21T03:55:50.046Z] at com.sun.javatest.regtest.agent.AgentServer.run(AgentServer.java:242)
[2024-11-21T03:55:50.046Z] at com.sun.javatest.regtest.agent.AgentServer.main(AgentServer.java:71)
[2024-11-21T03:55:50.046Z]
[2024-11-21T03:55:50.046Z] "Reference Handler" #2 daemon prio=10 os_prio=0 cpu=0.53ms elapsed=980.38s tid=0x0000ffff9c139890 nid=0xb2051 waiting on condition [0x0000ffff60ea6000]
[2024-11-21T03:55:50.046Z] java.lang.Thread.State: RUNNABLE
[2024-11-21T03:55:50.046Z] at java.lang.ref.Reference.waitForReferencePendingList(java.base@17.0.14-beta/Native Method)
[2024-11-21T03:55:50.046Z] at java.lang.ref.Reference.processPendingReferences(java.base@17.0.14-beta/Reference.java:253)
[2024-11-21T03:55:50.046Z] at java.lang.ref.Reference$ReferenceHandler.run(java.base@17.0.14-beta/Reference.java:215)
[2024-11-21T03:55:50.046Z]
[2024-11-21T03:55:50.046Z] "Finalizer" #3 daemon prio=8 os_prio=0 cpu=0.23ms elapsed=980.33s tid=0x0000ffff9c13af40 nid=0xb2053 in Object.wait() [0x0000ffff60ca8000]
[2024-11-21T03:55:50.046Z] java.lang.Thread.State: WAITING (on object monitor)
[2024-11-21T03:55:50.046Z] at java.lang.Object.wait(java.base@17.0.14-beta/Native Method)
[2024-11-21T03:55:50.046Z] - waiting on <0x0000ffff6549eea8> (a java.lang.ref.ReferenceQueue$Lock)
[2024-11-21T03:55:50.046Z] at java.lang.ref.ReferenceQueue.remove(java.base@17.0.14-beta/ReferenceQueue.java:155)
[2024-11-21T03:55:50.046Z] - locked <0x0000ffff6549eea8> (a java.lang.ref.ReferenceQueue$Lock)
[2024-11-21T03:55:50.046Z] at java.lang.ref.ReferenceQueue.remove(java.base@17.0.14-beta/ReferenceQueue.java:176)
[2024-11-21T03:55:50.046Z] at java.lang.ref.Finalizer$FinalizerThread.run(java.base@17.0.14-beta/Finalizer.java:172)
[2024-11-21T03:55:50.046Z]
[2024-11-21T03:55:50.046Z] "Signal Dispatcher" #4 daemon prio=9 os_prio=0 cpu=0.67ms elapsed=980.31s tid=0x0000ffff9c173620 nid=0xb2056 waiting on condition [0x0000000000000000]
[2024-11-21T03:55:50.046Z] java.lang.Thread.State: RUNNABLE
[2024-11-21T03:55:50.046Z]
[2024-11-21T03:55:50.046Z] "Service Thread" #5 daemon prio=9 os_prio=0 cpu=1.87ms elapsed=980.29s tid=0x0000ffff9c168350 nid=0xb2059 runnable [0x0000000000000000]
[2024-11-21T03:55:50.046Z] java.lang.Thread.State: RUNNABLE
[2024-11-21T03:55:50.046Z]
[2024-11-21T03:55:50.046Z] "Monitor Deflation Thread" #6 daemon prio=9 os_prio=0 cpu=91.51ms elapsed=980.26s tid=0x0000ffff9c1692f0 nid=0xb205a runnable [0x0000000000000000]
[2024-11-21T03:55:50.046Z] java.lang.Thread.State: RUNNABLE
[2024-11-21T03:55:50.046Z]
[2024-11-21T03:55:50.046Z] "C2 CompilerThread0" #7 daemon prio=9 os_prio=0 cpu=4936.15ms elapsed=980.25s tid=0x0000ffff9c16ac60 nid=0xb205b waiting on condition [0x0000000000000000]
[2024-11-21T03:55:50.046Z] java.lang.Thread.State: RUNNABLE
[2024-11-21T03:55:50.046Z] No compile task
[2024-11-21T03:55:50.046Z]
[2024-11-21T03:55:50.046Z] "C1 CompilerThread0" #9 daemon prio=9 os_prio=0 cpu=678.66ms elapsed=980.25s tid=0x0000ffff9c16c1c0 nid=0xb205d waiting on condition [0x0000000000000000]
[2024-11-21T03:55:50.046Z] java.lang.Thread.State: RUNNABLE
[2024-11-21T03:55:50.046Z] No compile task
[2024-11-21T03:55:50.046Z]
[2024-11-21T03:55:50.046Z] "Sweeper thread" #10 daemon prio=9 os_prio=0 cpu=0.10ms elapsed=980.20s tid=0x0000ffff9c16d680 nid=0xb205e runnable [0x0000000000000000]
[2024-11-21T03:55:50.046Z] java.lang.Thread.State: RUNNABLE
[2024-11-21T03:55:50.046Z]
[2024-11-21T03:55:50.046Z] "Common-Cleaner" #11 daemon prio=8 os_prio=0 cpu=1.63ms elapsed=979.98s tid=0x0000ffff9c1af270 nid=0xb205f in Object.wait() [0x0000ffff27e00000]
[2024-11-21T03:55:50.046Z] java.lang.Thread.State: TIMED_WAITING (on object monitor)
[2024-11-21T03:55:50.046Z] at java.lang.Object.wait(java.base@17.0.14-beta/Native Method)
[2024-11-21T03:55:50.046Z] - waiting on <0x0000ffff6549f288> (a java.lang.ref.ReferenceQueue$Lock)
[2024-11-21T03:55:50.046Z] at java.lang.ref.ReferenceQueue.remove(java.base@17.0.14-beta/ReferenceQueue.java:155)
[2024-11-21T03:55:50.046Z] - locked <0x0000ffff6549f288> (a java.lang.ref.ReferenceQueue$Lock)
[2024-11-21T03:55:50.046Z] at jdk.internal.ref.CleanerImpl.run(java.base@17.0.14-beta/CleanerImpl.java:140)
[2024-11-21T03:55:50.046Z] at java.lang.Thread.run(java.base@17.0.14-beta/Thread.java:840)
[2024-11-21T03:55:50.046Z] at jdk.internal.misc.InnocuousThread.run(java.base@17.0.14-beta/InnocuousThread.java:162)
[2024-11-21T03:55:50.046Z]
[2024-11-21T03:55:50.046Z] "Notification Thread" #12 daemon prio=9 os_prio=0 cpu=0.13ms elapsed=978.20s tid=0x0000ffff9c2429b0 nid=0xb206a runnable [0x0000000000000000]
[2024-11-21T03:55:50.046Z] java.lang.Thread.State: RUNNABLE
[2024-11-21T03:55:50.046Z]
[2024-11-21T03:55:50.046Z] "pool-1-thread-1" #13 daemon prio=5 os_prio=0 cpu=9.19ms elapsed=975.11s tid=0x0000ffff9c305d10 nid=0xb2075 waiting on condition [0x0000ffff27c01000]
[2024-11-21T03:55:50.046Z] java.lang.Thread.State: TIMED_WAITING (parking)
[2024-11-21T03:55:50.046Z] at jdk.internal.misc.Unsafe.park(java.base@17.0.14-beta/Native Method)
[2024-11-21T03:55:50.046Z] - parking to wait for <0x0000ffff6549f800> (a java.util.concurrent.locks.AbstractQueuedSynchronizer$ConditionObject)
[2024-11-21T03:55:50.046Z] at java.util.concurrent.locks.LockSupport.parkNanos(java.base@17.0.14-beta/LockSupport.java:252)
[2024-11-21T03:55:50.046Z] at java.util.concurrent.locks.AbstractQueuedSynchronizer$ConditionObject.awaitNanos(java.base@17.0.14-beta/AbstractQueuedSynchronizer.java:1679)
[2024-11-21T03:55:50.046Z] at java.util.concurrent.ScheduledThreadPoolExecutor$DelayedWorkQueue.take(java.base@17.0.14-beta/ScheduledThreadPoolExecutor.java:1182)
[2024-11-21T03:55:50.046Z] at java.util.concurrent.ScheduledThreadPoolExecutor$DelayedWorkQueue.take(java.base@17.0.14-beta/ScheduledThreadPoolExecutor.java:899)
[2024-11-21T03:55:50.046Z] at java.util.concurrent.ThreadPoolExecutor.getTask(java.base@17.0.14-beta/ThreadPoolExecutor.java:1062)
[2024-11-21T03:55:50.046Z] at java.util.concurrent.ThreadPoolExecutor.runWorker(java.base@17.0.14-beta/ThreadPoolExecutor.java:1122)
[2024-11-21T03:55:50.046Z] at java.util.concurrent.ThreadPoolExecutor$Worker.run(java.base@17.0.14-beta/ThreadPoolExecutor.java:635)
[2024-11-21T03:55:50.046Z] at java.lang.Thread.run(java.base@17.0.14-beta/Thread.java:840)
[2024-11-21T03:55:50.046Z]
[2024-11-21T03:55:50.046Z] "AgentVMThread" #16 prio=5 os_prio=0 cpu=60194.50ms elapsed=964.23s tid=0x0000ffff9c380f40 nid=0xb209f runnable [0x0000ffff275a5000]
[2024-11-21T03:55:50.046Z] java.lang.Thread.State: RUNNABLE
[2024-11-21T03:55:50.046Z] at sun.security.util.math.intpoly.IntegerPolynomial448.carryReduce(java.base@17.0.14-beta/IntegerPolynomial448.java:99)
[2024-11-21T03:55:50.046Z] at sun.security.util.math.intpoly.IntegerPolynomial448.square(java.base@17.0.14-beta/IntegerPolynomial448.java:366)
[2024-11-21T03:55:50.046Z] at sun.security.util.math.intpoly.IntegerPolynomial$MutableElement.setSquare(java.base@17.0.14-beta/IntegerPolynomial.java:736)
[2024-11-21T03:55:50.046Z] at sun.security.util.math.intpoly.IntegerPolynomial$MutableElement.setSquare(java.base@17.0.14-beta/IntegerPolynomial.java:624)
[2024-11-21T03:55:50.046Z] at sun.security.ec.ed.Ed448Operations.setDouble(jdk.crypto.ec@17.0.14-beta/Ed448Operations.java:183)
[2024-11-21T03:55:50.046Z] at sun.security.ec.ed.Ed448Operations.setDouble(jdk.crypto.ec@17.0.14-beta/Ed448Operations.java:93)
[2024-11-21T03:55:50.046Z] at sun.security.ec.ed.EdECOperations.setProduct(jdk.crypto.ec@17.0.14-beta/EdECOperations.java:78)
[2024-11-21T03:55:50.046Z] at sun.security.ec.ed.Ed448Operations.basePointMultiply(jdk.crypto.ec@17.0.14-beta/Ed448Operations.java:67)
[2024-11-21T03:55:50.046Z] at sun.security.ec.ed.EdDSAOperations.sign(jdk.crypto.ec@17.0.14-beta/EdDSAOperations.java:107)
[2024-11-21T03:55:50.046Z] at sun.security.ec.ed.EdDSASignature.engineSign(jdk.crypto.ec@17.0.14-beta/EdDSASignature.java:202)
[2024-11-21T03:55:50.046Z] at java.security.Signature$Delegate.engineSign(java.base@17.0.14-beta/Signature.java:1423)
[2024-11-21T03:55:50.046Z] at java.security.Signature.sign(java.base@17.0.14-beta/Signature.java:712)
[2024-11-21T03:55:50.046Z] at EdDSATest.signAndVerify(EdDSATest.java:225)
[2024-11-21T03:55:50.046Z] at EdDSATest.testSignature(EdDSATest.java:198)
[2024-11-21T03:55:50.046Z] at EdDSATest.test(EdDSATest.java:123)
[2024-11-21T03:55:50.046Z] at EdDSATest.main(EdDSATest.java:90)
[2024-11-21T03:55:50.046Z] at jdk.internal.reflect.NativeMethodAccessorImpl.invoke0(java.base@17.0.14-beta/Native Method)
[2024-11-21T03:55:50.046Z] at jdk.internal.reflect.NativeMethodAccessorImpl.invoke(java.base@17.0.14-beta/NativeMethodAccessorImpl.java:77)
[2024-11-21T03:55:50.046Z] at jdk.internal.reflect.DelegatingMethodAccessorImpl.invoke(java.base@17.0.14-beta/DelegatingMethodAccessorImpl.java:43)
[2024-11-21T03:55:50.046Z] at java.lang.reflect.Method.invoke(java.base@17.0.14-beta/Method.java:569)
[2024-11-21T03:55:50.046Z] at com.sun.javatest.regtest.agent.MainActionHelper$AgentVMRunnable.run(MainActionHelper.java:333)
[2024-11-21T03:55:50.046Z] at java.lang.Thread.run(java.base@17.0.14-beta/Thread.java:840)
[2024-11-21T03:55:50.046Z]
[2024-11-21T03:55:50.046Z] "Attach Listener" #17 daemon prio=9 os_prio=0 cpu=0.77ms elapsed=0.28s tid=0x0000ffff3c000f80 nid=0xb2c2f waiting on condition [0x0000000000000000]
[2024-11-21T03:55:50.046Z] java.lang.Thread.State: RUNNABLE
[2024-11-21T03:55:50.046Z]
[2024-11-21T03:55:50.046Z] "G1 Refine#1" os_prio=0 cpu=0.13ms elapsed=965.76s tid=0x0000ffff4c000e40 nid=0xb209c runnable
[2024-11-21T03:55:50.046Z]
[2024-11-21T03:55:50.046Z] "GC Thread#3" os_prio=0 cpu=25.96ms elapsed=965.92s tid=0x0000ffff400064f0 nid=0xb209b runnable
[2024-11-21T03:55:50.046Z]
[2024-11-21T03:55:50.046Z] "GC Thread#2" os_prio=0 cpu=14.36ms elapsed=966.11s tid=0x0000ffff40005aa0 nid=0xb209a runnable
[2024-11-21T03:55:50.046Z]
[2024-11-21T03:55:50.046Z] "GC Thread#1" os_prio=0 cpu=27.31ms elapsed=966.12s tid=0x0000ffff40005050 nid=0xb2099 runnable
[2024-11-21T03:55:50.046Z]
[2024-11-21T03:55:50.046Z] "VM Periodic Task Thread" os_prio=0 cpu=327.99ms elapsed=978.17s tid=0x0000ffff9c244130 nid=0xb206b waiting on condition
[2024-11-21T03:55:50.046Z]
[2024-11-21T03:55:50.046Z] "VM Thread" os_prio=0 cpu=72.09ms elapsed=980.49s tid=0x0000ffff9c12a0f0 nid=0xb204e runnable
[2024-11-21T03:55:50.046Z]
[2024-11-21T03:55:50.046Z] "G1 Service" os_prio=0 cpu=148.93ms elapsed=980.63s tid=0x0000ffff9c0b11b0 nid=0xb204b runnable
[2024-11-21T03:55:50.046Z]
[2024-11-21T03:55:50.046Z] "G1 Refine#0" os_prio=0 cpu=1.76ms elapsed=980.89s tid=0x0000ffff9c0b02a0 nid=0xb2046 runnable
[2024-11-21T03:55:50.046Z]
[2024-11-21T03:55:50.046Z] "G1 Conc#0" os_prio=0 cpu=0.10ms elapsed=980.98s tid=0x0000ffff9c05de10 nid=0xb2043 runnable
[2024-11-21T03:55:50.046Z]
[2024-11-21T03:55:50.046Z] "G1 Main Marker" os_prio=0 cpu=0.12ms elapsed=981.16s tid=0x0000ffff9c05ce90 nid=0xb203e runnable
[2024-11-21T03:55:50.046Z]
[2024-11-21T03:55:50.046Z] "GC Thread#0" os_prio=0 cpu=31.02ms elapsed=981.21s tid=0x0000ffff9c057a00 nid=0xb203c runnable
[2024-11-21T03:55:50.046Z]
[2024-11-21T03:55:50.046Z] JNI global refs: 17, weak refs: 0
[2024-11-21T03:55:50.046Z]
[2024-11-21T03:55:50.046Z] --- Timeout information end.
[2024-11-21T03:55:50.046Z] finished: Thu Nov 21 03:55:46 UTC 2024
[2024-11-21T03:55:50.046Z] elapsed time (seconds): 965.193
[2024-11-21T03:55:50.046Z] configuration:
[2024-11-21T03:55:50.046Z] Boot Layer
[2024-11-21T03:55:50.046Z] class path: /home/jenkins/workspace/Test_openjdk17_hs_extended.openjdk_aarch64_linux_testList_0/jvmtest/openjdk/jtreg/lib/javatest.jar
[2024-11-21T03:55:50.046Z] /home/jenkins/workspace/Test_openjdk17_hs_extended.openjdk_aarch64_linux_testList_0/jvmtest/openjdk/jtreg/lib/jtreg.jar
[2024-11-21T03:55:50.046Z] /home/jenkins/workspace/Test_openjdk17_hs_extended.openjdk_aarch64_linux_testList_0/jvmtest/openjdk/jtreg/lib/junit-platform-console-standalone-1.9.2.jar
[2024-11-21T03:55:50.046Z] /home/jenkins/workspace/Test_openjdk17_hs_extended.openjdk_aarch64_linux_testList_0/jvmtest/openjdk/jtreg/lib/testng-7.3.0.jar
[2024-11-21T03:55:50.046Z] /home/jenkins/workspace/Test_openjdk17_hs_extended.openjdk_aarch64_linux_testList_0/jvmtest/openjdk/jtreg/lib/guice-5.1.0.jar
[2024-11-21T03:55:50.046Z] /home/jenkins/workspace/Test_openjdk17_hs_extended.openjdk_aarch64_linux_testList_0/jvmtest/openjdk/jtreg/lib/jcommander-1.82.jar
[2024-11-21T03:55:50.046Z] patch: java.base /home/jenkins/workspace/Test_openjdk17_hs_extended.openjdk_aarch64_linux_testList_0/aqa-tests/TKG/output_17321563695498/jdk_security3_1/work/patches/java.base
[2024-11-21T03:55:50.046Z]
[2024-11-21T03:55:50.046Z] Test Layer
[2024-11-21T03:55:50.046Z] class path: /home/jenkins/workspace/Test_openjdk17_hs_extended.openjdk_aarch64_linux_testList_0/aqa-tests/TKG/output_17321563695498/jdk_security3_1/work/classes/1/sun/security/ec/ed/EdDSATest.d
[2024-11-21T03:55:50.046Z] /home/jenkins/workspace/Test_openjdk17_hs_extended.openjdk_aarch64_linux_testList_0/aqa-tests/openjdk/openjdk-jdk/test/jdk/sun/security/ec/ed
[2024-11-21T03:55:50.046Z] /home/jenkins/workspace/Test_openjdk17_hs_extended.openjdk_aarch64_linux_testList_0/aqa-tests/TKG/output_17321563695498/jdk_security3_1/work/classes/1/test/lib
[2024-11-21T03:55:50.047Z] /home/jenkins/workspace/Test_openjdk17_hs_extended.openjdk_aarch64_linux_testList_0/aqa-tests/openjdk/openjdk-jdk/test/lib
[2024-11-21T03:55:50.047Z]
[2024-11-21T03:55:50.047Z] rerun:
[2024-11-21T03:55:50.047Z] cd /home/jenkins/workspace/Test_openjdk17_hs_extended.openjdk_aarch64_linux_testList_0/aqa-tests/TKG/output_17321563695498/jdk_security3_1/work/scratch/1 && \
[2024-11-21T03:55:50.047Z] DISPLAY=:0 \
[2024-11-21T03:55:50.047Z] HOME=/home/jenkins \
[2024-11-21T03:55:50.047Z] LANG=C.utf8 \
[2024-11-21T03:55:50.047Z] PATH=/bin:/usr/bin:/usr/sbin \
[2024-11-21T03:55:50.047Z] /home/jenkins/workspace/Test_openjdk17_hs_extended.openjdk_aarch64_linux_testList_0/jdkbinary/j2sdk-image/bin/java \
[2024-11-21T03:55:50.047Z] -Dtest.vm.opts='-ea -esa -Xmx512m -XX:-UseCompressedOops' \
[2024-11-21T03:55:50.047Z] -Dtest.tool.vm.opts='-J-ea -J-esa -J-Xmx512m -J-XX:-UseCompressedOops' \
[2024-11-21T03:55:50.047Z] -Dtest.compiler.opts= \
[2024-11-21T03:55:50.047Z] -Dtest.java.opts= \
[2024-11-21T03:55:50.047Z] -Dtest.jdk=/home/jenkins/workspace/Test_openjdk17_hs_extended.openjdk_aarch64_linux_testList_0/jdkbinary/j2sdk-image \
[2024-11-21T03:55:50.047Z] -Dcompile.jdk=/home/jenkins/workspace/Test_openjdk17_hs_extended.openjdk_aarch64_linux_testList_0/jdkbinary/j2sdk-image \
[2024-11-21T03:55:50.047Z] -Dtest.timeout.factor=8.0 \
[2024-11-21T03:55:50.047Z] -Dtest.nativepath=/home/jenkins/workspace/Test_openjdk17_hs_extended.openjdk_aarch64_linux_testList_0/jdkbinary/openjdk-test-image/jdk/jtreg/native \
[2024-11-21T03:55:50.047Z] -Dtest.root=/home/jenkins/workspace/Test_openjdk17_hs_extended.openjdk_aarch64_linux_testList_0/aqa-tests/openjdk/openjdk-jdk/test/jdk \
[2024-11-21T03:55:50.047Z] -Dtest.name=sun/security/ec/ed/EdDSATest.java \
[2024-11-21T03:55:50.047Z] -Dtest.file=/home/jenkins/workspace/Test_openjdk17_hs_extended.openjdk_aarch64_linux_testList_0/aqa-tests/openjdk/openjdk-jdk/test/jdk/sun/security/ec/ed/EdDSATest.java \
[2024-11-21T03:55:50.047Z] -Dtest.src=/home/jenkins/workspace/Test_openjdk17_hs_extended.openjdk_aarch64_linux_testList_0/aqa-tests/openjdk/openjdk-jdk/test/jdk/sun/security/ec/ed \
[2024-11-21T03:55:50.047Z] -Dtest.src.path=/home/jenkins/workspace/Test_openjdk17_hs_extended.openjdk_aarch64_linux_testList_0/aqa-tests/openjdk/openjdk-jdk/test/jdk/sun/security/ec/ed:/home/jenkins/workspace/Test_openjdk17_hs_extended.openjdk_aarch64_linux_testList_0/aqa-tests/openjdk/openjdk-jdk/test/lib \
[2024-11-21T03:55:50.047Z] -Dtest.classes=/home/jenkins/workspace/Test_openjdk17_hs_extended.openjdk_aarch64_linux_testList_0/aqa-tests/TKG/output_17321563695498/jdk_security3_1/work/classes/1/sun/security/ec/ed/EdDSATest.d \
[2024-11-21T03:55:50.047Z] -Dtest.class.path=/home/jenkins/workspace/Test_openjdk17_hs_extended.openjdk_aarch64_linux_testList_0/aqa-tests/TKG/output_17321563695498/jdk_security3_1/work/classes/1/sun/security/ec/ed/EdDSATest.d:/home/jenkins/workspace/Test_openjdk17_hs_extended.openjdk_aarch64_linux_testList_0/aqa-tests/TKG/output_17321563695498/jdk_security3_1/work/classes/1/test/lib \
[2024-11-21T03:55:50.047Z] -Dtest.class.path.prefix=/home/jenkins/workspace/Test_openjdk17_hs_extended.openjdk_aarch64_linux_testList_0/aqa-tests/TKG/output_17321563695498/jdk_security3_1/work/classes/1/sun/security/ec/ed/EdDSATest.d:/home/jenkins/workspace/Test_openjdk17_hs_extended.openjdk_aarch64_linux_testList_0/aqa-tests/openjdk/openjdk-jdk/test/jdk/sun/security/ec/ed:/home/jenkins/workspace/Test_openjdk17_hs_extended.openjdk_aarch64_linux_testList_0/aqa-tests/TKG/output_17321563695498/jdk_security3_1/work/classes/1/test/lib \
[2024-11-21T03:55:50.047Z] -classpath /home/jenkins/workspace/Test_openjdk17_hs_extended.openjdk_aarch64_linux_testList_0/aqa-tests/TKG/output_17321563695498/jdk_security3_1/work/classes/1/sun/security/ec/ed/EdDSATest.d:/home/jenkins/workspace/Test_openjdk17_hs_extended.openjdk_aarch64_linux_testList_0/aqa-tests/openjdk/openjdk-jdk/test/jdk/sun/security/ec/ed:/home/jenkins/workspace/Test_openjdk17_hs_extended.openjdk_aarch64_linux_testList_0/aqa-tests/TKG/output_17321563695498/jdk_security3_1/work/classes/1/test/lib:/home/jenkins/workspace/Test_openjdk17_hs_extended.openjdk_aarch64_linux_testList_0/aqa-tests/openjdk/openjdk-jdk/test/lib:/home/jenkins/workspace/Test_openjdk17_hs_extended.openjdk_aarch64_linux_testList_0/jvmtest/openjdk/jtreg/lib/javatest.jar:/home/jenkins/workspace/Test_openjdk17_hs_extended.openjdk_aarch64_linux_testList_0/jvmtest/openjdk/jtreg/lib/jtreg.jar \
[2024-11-21T03:55:50.047Z] EdDSATest
[2024-11-21T03:55:50.047Z] STDOUT:
[2024-11-21T03:55:50.047Z] Case Algo:EdDSA, Param:null, Intitiate with random:true
[2024-11-21T03:55:50.047Z] Passed.
[2024-11-21T03:55:50.047Z] Case Algo:Ed25519, Param:null, Intitiate with random:true
[2024-11-21T03:55:50.047Z] Passed.
[2024-11-21T03:55:50.047Z] Case Algo:Ed448, Param:null, Intitiate with random:true
[2024-11-21T03:55:50.047Z] Passed.
[2024-11-21T03:55:50.047Z] Case Algo:EdDSA, Param:Ed25519, Intitiate with random:true
[2024-11-21T03:55:50.047Z] Passed.
[2024-11-21T03:55:50.047Z] Case Algo:Ed25519, Param:Ed25519, Intitiate with random:true
[2024-11-21T03:55:50.047Z] Passed.
[2024-11-21T03:55:50.047Z] Case Algo:1.3.101.112, Param:Ed25519, Intitiate with random:true
[2024-11-21T03:55:50.047Z] Passed.
[2024-11-21T03:55:50.047Z] Case Algo:OID.1.3.101.112, Param:Ed25519, Intitiate with random:true
[2024-11-21T03:55:50.047Z] Passed.
[2024-11-21T03:55:50.047Z] Case Algo:Ed448, Param:Ed448, Intitiate with random:true
[2024-11-21T03:55:50.047Z] Passed.
[2024-11-21T03:55:50.047Z] Case Algo:1.3.101.113, Param:Ed448, Intitiate with random:true
[2024-11-21T03:55:50.047Z] Passed.
[2024-11-21T03:55:50.047Z] Case Algo:OID.1.3.101.113, Param:Ed448, Intitiate with random:true
[2024-11-21T03:55:50.047Z] Passed.
[2024-11-21T03:55:50.047Z] Case Algo:EdDSA, Param:255, Intitiate with random:true
[2024-11-21T03:55:50.047Z] Passed.
[2024-11-21T03:55:50.047Z] Case Algo:Ed25519, Param:255, Intitiate with random:true
[2024-11-21T03:55:50.047Z] Passed.
[2024-11-21T03:55:50.047Z] Case Algo:1.3.101.112, Param:255, Intitiate with random:true
[2024-11-21T03:55:50.047Z] Passed.
[2024-11-21T03:55:50.047Z] Case Algo:OID.1.3.101.112, Param:255, Intitiate with random:true
[2024-11-21T03:55:50.047Z] Passed.
[2024-11-21T03:55:50.047Z] Case Algo:Ed448, Param:448, Intitiate with random:true
[2024-11-21T03:55:50.047Z] Passed.
[2024-11-21T03:55:50.047Z] Case Algo:1.3.101.113, Param:448, Intitiate with random:true
[2024-11-21T03:55:50.047Z] Passed.
[2024-11-21T03:55:50.047Z] Case Algo:OID.1.3.101.113, Param:448, Intitiate with random:true
[2024-11-21T03:55:50.047Z] Passed.
[2024-11-21T03:55:50.047Z] Case Algo:EdDSA, Param:null, Intitiate with random:false
[2024-11-21T03:55:50.047Z] Passed.
[2024-11-21T03:55:50.047Z] Case Algo:Ed25519, Param:null, Intitiate with random:false
[2024-11-21T03:55:50.047Z] Passed.
[2024-11-21T03:55:50.047Z] Case Algo:Ed448, Param:null, Intitiate with random:false
[2024-11-21T03:55:50.047Z] Passed.
[2024-11-21T03:55:50.047Z] Case Algo:EdDSA, Param:Ed25519, Intitiate with random:false
[2024-11-21T03:55:50.047Z] Passed.
[2024-11-21T03:55:50.047Z] Case Algo:Ed25519, Param:Ed25519, Intitiate with random:false
[2024-11-21T03:55:50.047Z] Passed.
[2024-11-21T03:55:50.047Z] Case Algo:1.3.101.112, Param:Ed25519, Intitiate with random:false
[2024-11-21T03:55:50.047Z] Passed.
[2024-11-21T03:55:50.047Z] Case Algo:OID.1.3.101.112, Param:Ed25519, Intitiate with random:false
[2024-11-21T03:55:50.047Z] Passed.
[2024-11-21T03:55:50.047Z] Case Algo:Ed448, Param:Ed448, Intitiate with random:false
[2024-11-21T03:55:50.047Z] Passed.
[2024-11-21T03:55:50.047Z] Case Algo:1.3.101.113, Param:Ed448, Intitiate with random:false
[2024-11-21T03:55:50.047Z]
[2024-11-21T03:55:50.047Z] TEST RESULT: Error. Agent error: java.lang.Exception: Agent 22 timed out with a timeout of 960 seconds; check console log for any additional details
[2024-11-21T03:55:50.047Z] --------------------------------------------------
[2024-11-21T04:47:19.763Z] TEST: sun/security/ssl/X509TrustManagerImpl/distrust/Symantec.java
[2024-11-21T04:47:19.763Z] TEST JDK: /home/jenkins/workspace/Test_openjdk17_hs_extended.openjdk_aarch64_linux_testList_0/jdkbinary/j2sdk-image
[2024-11-21T04:47:19.763Z]
[2024-11-21T04:47:19.763Z] ACTION: build -- Passed. Build successful
[2024-11-21T04:47:19.763Z] REASON: Named class compiled on demand
[2024-11-21T04:47:19.763Z] TIME: 1.163 seconds
[2024-11-21T04:47:19.763Z] messages:
[2024-11-21T04:47:19.763Z] command: build Symantec
[2024-11-21T04:47:19.763Z] reason: Named class compiled on demand
[2024-11-21T04:47:19.763Z] started: Thu Nov 21 04:47:00 UTC 2024
[2024-11-21T04:47:19.763Z] Test directory:
[2024-11-21T04:47:19.763Z] compile: Symantec
[2024-11-21T04:47:19.763Z] finished: Thu Nov 21 04:47:01 UTC 2024
[2024-11-21T04:47:19.763Z] elapsed time (seconds): 1.163
[2024-11-21T04:47:19.763Z]
[2024-11-21T04:47:19.763Z] ACTION: compile -- Passed. Compilation successful
[2024-11-21T04:47:19.763Z] REASON: .class file out of date or does not exist
[2024-11-21T04:47:19.763Z] TIME: 1.163 seconds
[2024-11-21T04:47:19.763Z] messages:
[2024-11-21T04:47:19.763Z] command: compile /home/jenkins/workspace/Test_openjdk17_hs_extended.openjdk_aarch64_linux_testList_0/aqa-tests/openjdk/openjdk-jdk/test/jdk/sun/security/ssl/X509TrustManagerImpl/distrust/Symantec.java
[2024-11-21T04:47:19.763Z] reason: .class file out of date or does not exist
[2024-11-21T04:47:19.763Z] started: Thu Nov 21 04:47:00 UTC 2024
[2024-11-21T04:47:19.763Z] Additional options from @modules: --add-modules java.base --add-exports java.base/sun.security.validator=ALL-UNNAMED
[2024-11-21T04:47:19.763Z] Mode: agentvm
[2024-11-21T04:47:19.763Z] Agent id: 3
[2024-11-21T04:47:19.763Z] finished: Thu Nov 21 04:47:01 UTC 2024
[2024-11-21T04:47:19.763Z] elapsed time (seconds): 1.163
[2024-11-21T04:47:19.763Z] configuration:
[2024-11-21T04:47:19.763Z] Boot Layer (javac runtime environment)
[2024-11-21T04:47:19.763Z] class path: /home/jenkins/workspace/Test_openjdk17_hs_extended.openjdk_aarch64_linux_testList_0/jvmtest/openjdk/jtreg/lib/javatest.jar
[2024-11-21T04:47:19.763Z] /home/jenkins/workspace/Test_openjdk17_hs_extended.openjdk_aarch64_linux_testList_0/jvmtest/openjdk/jtreg/lib/jtreg.jar
[2024-11-21T04:47:19.763Z] patch: java.base /home/jenkins/workspace/Test_openjdk17_hs_extended.openjdk_aarch64_linux_testList_0/aqa-tests/TKG/output_17321563695498/jdk_security3_1/work/patches/java.base
[2024-11-21T04:47:19.763Z]
[2024-11-21T04:47:19.763Z] javac compilation environment
[2024-11-21T04:47:19.763Z] add modules: java.base
[2024-11-21T04:47:19.763Z] add exports: java.base/sun.security.validator ALL-UNNAMED
[2024-11-21T04:47:19.763Z] source path: /home/jenkins/workspace/Test_openjdk17_hs_extended.openjdk_aarch64_linux_testList_0/aqa-tests/openjdk/openjdk-jdk/test/jdk/sun/security/ssl/X509TrustManagerImpl/distrust
[2024-11-21T04:47:19.763Z] /home/jenkins/workspace/Test_openjdk17_hs_extended.openjdk_aarch64_linux_testList_0/aqa-tests/openjdk/openjdk-jdk/test/lib
[2024-11-21T04:47:19.763Z] class path: /home/jenkins/workspace/Test_openjdk17_hs_extended.openjdk_aarch64_linux_testList_0/aqa-tests/openjdk/openjdk-jdk/test/jdk/sun/security/ssl/X509TrustManagerImpl/distrust
[2024-11-21T04:47:19.763Z] /home/jenkins/workspace/Test_openjdk17_hs_extended.openjdk_aarch64_linux_testList_0/aqa-tests/TKG/output_17321563695498/jdk_security3_1/work/classes/0/sun/security/ssl/X509TrustManagerImpl/distrust/Symantec.d
[2024-11-21T04:47:19.763Z] /home/jenkins/workspace/Test_openjdk17_hs_extended.openjdk_aarch64_linux_testList_0/aqa-tests/TKG/output_17321563695498/jdk_security3_1/work/classes/0/test/lib
[2024-11-21T04:47:19.763Z]
[2024-11-21T04:47:19.763Z] rerun:
[2024-11-21T04:47:19.763Z] cd /home/jenkins/workspace/Test_openjdk17_hs_extended.openjdk_aarch64_linux_testList_0/aqa-tests/TKG/output_17321563695498/jdk_security3_1/work/scratch/2 && \
[2024-11-21T04:47:19.763Z] DISPLAY=:0 \
[2024-11-21T04:47:19.763Z] HOME=/home/jenkins \
[2024-11-21T04:47:19.763Z] LANG=C.utf8 \
[2024-11-21T04:47:19.763Z] PATH=/bin:/usr/bin:/usr/sbin \
[2024-11-21T04:47:19.763Z] /home/jenkins/workspace/Test_openjdk17_hs_extended.openjdk_aarch64_linux_testList_0/jdkbinary/j2sdk-image/bin/javac \
[2024-11-21T04:47:19.763Z] -J-ea \
[2024-11-21T04:47:19.763Z] -J-esa \
[2024-11-21T04:47:19.763Z] -J-Xmx512m \
[2024-11-21T04:47:19.763Z] -J-XX:-UseCompressedOops \
[2024-11-21T04:47:19.763Z] -J-Dtest.vm.opts='-ea -esa -Xmx512m -XX:-UseCompressedOops' \
[2024-11-21T04:47:19.763Z] -J-Dtest.tool.vm.opts='-J-ea -J-esa -J-Xmx512m -J-XX:-UseCompressedOops' \
[2024-11-21T04:47:19.763Z] -J-Dtest.compiler.opts= \
[2024-11-21T04:47:19.763Z] -J-Dtest.java.opts= \
[2024-11-21T04:47:19.763Z] -J-Dtest.jdk=/home/jenkins/workspace/Test_openjdk17_hs_extended.openjdk_aarch64_linux_testList_0/jdkbinary/j2sdk-image \
[2024-11-21T04:47:19.763Z] -J-Dcompile.jdk=/home/jenkins/workspace/Test_openjdk17_hs_extended.openjdk_aarch64_linux_testList_0/jdkbinary/j2sdk-image \
[2024-11-21T04:47:19.763Z] -J-Dtest.timeout.factor=8.0 \
[2024-11-21T04:47:19.764Z] -J-Dtest.nativepath=/home/jenkins/workspace/Test_openjdk17_hs_extended.openjdk_aarch64_linux_testList_0/jdkbinary/openjdk-test-image/jdk/jtreg/native \
[2024-11-21T04:47:19.764Z] -J-Dtest.root=/home/jenkins/workspace/Test_openjdk17_hs_extended.openjdk_aarch64_linux_testList_0/aqa-tests/openjdk/openjdk-jdk/test/jdk \
[2024-11-21T04:47:19.764Z] -J-Dtest.name=sun/security/ssl/X509TrustManagerImpl/distrust/Symantec.java \
[2024-11-21T04:47:19.764Z] -J-Dtest.file=/home/jenkins/workspace/Test_openjdk17_hs_extended.openjdk_aarch64_linux_testList_0/aqa-tests/openjdk/openjdk-jdk/test/jdk/sun/security/ssl/X509TrustManagerImpl/distrust/Symantec.java \
[2024-11-21T04:47:19.764Z] -J-Dtest.src=/home/jenkins/workspace/Test_openjdk17_hs_extended.openjdk_aarch64_linux_testList_0/aqa-tests/openjdk/openjdk-jdk/test/jdk/sun/security/ssl/X509TrustManagerImpl/distrust \
[2024-11-21T04:47:19.764Z] -J-Dtest.src.path=/home/jenkins/workspace/Test_openjdk17_hs_extended.openjdk_aarch64_linux_testList_0/aqa-tests/openjdk/openjdk-jdk/test/jdk/sun/security/ssl/X509TrustManagerImpl/distrust:/home/jenkins/workspace/Test_openjdk17_hs_extended.openjdk_aarch64_linux_testList_0/aqa-tests/openjdk/openjdk-jdk/test/lib \
[2024-11-21T04:47:19.764Z] -J-Dtest.classes=/home/jenkins/workspace/Test_openjdk17_hs_extended.openjdk_aarch64_linux_testList_0/aqa-tests/TKG/output_17321563695498/jdk_security3_1/work/classes/0/sun/security/ssl/X509TrustManagerImpl/distrust/Symantec.d \
[2024-11-21T04:47:19.764Z] -J-Dtest.class.path=/home/jenkins/workspace/Test_openjdk17_hs_extended.openjdk_aarch64_linux_testList_0/aqa-tests/TKG/output_17321563695498/jdk_security3_1/work/classes/0/sun/security/ssl/X509TrustManagerImpl/distrust/Symantec.d:/home/jenkins/workspace/Test_openjdk17_hs_extended.openjdk_aarch64_linux_testList_0/aqa-tests/TKG/output_17321563695498/jdk_security3_1/work/classes/0/test/lib \
[2024-11-21T04:47:19.764Z] -J-Dtest.class.path.prefix=/home/jenkins/workspace/Test_openjdk17_hs_extended.openjdk_aarch64_linux_testList_0/aqa-tests/TKG/output_17321563695498/jdk_security3_1/work/classes/0/sun/security/ssl/X509TrustManagerImpl/distrust/Symantec.d:/home/jenkins/workspace/Test_openjdk17_hs_extended.openjdk_aarch64_linux_testList_0/aqa-tests/openjdk/openjdk-jdk/test/jdk/sun/security/ssl/X509TrustManagerImpl/distrust:/home/jenkins/workspace/Test_openjdk17_hs_extended.openjdk_aarch64_linux_testList_0/aqa-tests/TKG/output_17321563695498/jdk_security3_1/work/classes/0/test/lib \
[2024-11-21T04:47:19.764Z] -J-Dtest.modules=java.base/sun.security.validator \
[2024-11-21T04:47:19.764Z] --add-modules java.base \
[2024-11-21T04:47:19.764Z] --add-exports java.base/sun.security.validator=ALL-UNNAMED \
[2024-11-21T04:47:19.764Z] -d /home/jenkins/workspace/Test_openjdk17_hs_extended.openjdk_aarch64_linux_testList_0/aqa-tests/TKG/output_17321563695498/jdk_security3_1/work/classes/0/sun/security/ssl/X509TrustManagerImpl/distrust/Symantec.d \
[2024-11-21T04:47:19.764Z] -sourcepath /home/jenkins/workspace/Test_openjdk17_hs_extended.openjdk_aarch64_linux_testList_0/aqa-tests/openjdk/openjdk-jdk/test/jdk/sun/security/ssl/X509TrustManagerImpl/distrust:/home/jenkins/workspace/Test_openjdk17_hs_extended.openjdk_aarch64_linux_testList_0/aqa-tests/openjdk/openjdk-jdk/test/lib \
[2024-11-21T04:47:19.764Z] -classpath /home/jenkins/workspace/Test_openjdk17_hs_extended.openjdk_aarch64_linux_testList_0/aqa-tests/openjdk/openjdk-jdk/test/jdk/sun/security/ssl/X509TrustManagerImpl/distrust:/home/jenkins/workspace/Test_openjdk17_hs_extended.openjdk_aarch64_linux_testList_0/aqa-tests/TKG/output_17321563695498/jdk_security3_1/work/classes/0/sun/security/ssl/X509TrustManagerImpl/distrust/Symantec.d:/home/jenkins/workspace/Test_openjdk17_hs_extended.openjdk_aarch64_linux_testList_0/aqa-tests/TKG/output_17321563695498/jdk_security3_1/work/classes/0/test/lib /home/jenkins/workspace/Test_openjdk17_hs_extended.openjdk_aarch64_linux_testList_0/aqa-tests/openjdk/openjdk-jdk/test/jdk/sun/security/ssl/X509TrustManagerImpl/distrust/Symantec.java
[2024-11-21T04:47:19.764Z] direct:
[2024-11-21T04:47:19.764Z] /home/jenkins/workspace/Test_openjdk17_hs_extended.openjdk_aarch64_linux_testList_0/aqa-tests/openjdk/openjdk-jdk/test/jdk/sun/security/ssl/X509TrustManagerImpl/distrust/Distrust.java:31: warning: Validator is internal proprietary API and may be removed in a future release
[2024-11-21T04:47:19.764Z] import sun.security.validator.Validator;
[2024-11-21T04:47:19.764Z] ^
[2024-11-21T04:47:19.764Z] /home/jenkins/workspace/Test_openjdk17_hs_extended.openjdk_aarch64_linux_testList_0/aqa-tests/openjdk/openjdk-jdk/test/jdk/sun/security/ssl/X509TrustManagerImpl/distrust/Distrust.java:32: warning: ValidatorException is internal proprietary API and may be removed in a future release
[2024-11-21T04:47:19.764Z] import sun.security.validator.ValidatorException;
[2024-11-21T04:47:19.764Z] ^
[2024-11-21T04:47:19.764Z] /home/jenkins/workspace/Test_openjdk17_hs_extended.openjdk_aarch64_linux_testList_0/aqa-tests/openjdk/openjdk-jdk/test/jdk/sun/security/ssl/X509TrustManagerImpl/distrust/Distrust.java:67: warning: Validator is internal proprietary API and may be removed in a future release
[2024-11-21T04:47:19.764Z] Validator v = Validator.getInstance(Validator.TYPE_PKIX,
[2024-11-21T04:47:19.764Z] ^
[2024-11-21T04:47:19.764Z] /home/jenkins/workspace/Test_openjdk17_hs_extended.openjdk_aarch64_linux_testList_0/aqa-tests/openjdk/openjdk-jdk/test/jdk/sun/security/ssl/X509TrustManagerImpl/distrust/Distrust.java:67: warning: Validator is internal proprietary API and may be removed in a future release
[2024-11-21T04:47:19.764Z] Validator v = Validator.getInstance(Validator.TYPE_PKIX,
[2024-11-21T04:47:19.764Z] ^
[2024-11-21T04:47:19.764Z] /home/jenkins/workspace/Test_openjdk17_hs_extended.openjdk_aarch64_linux_testList_0/aqa-tests/openjdk/openjdk-jdk/test/jdk/sun/security/ssl/X509TrustManagerImpl/distrust/Distrust.java:68: warning: Validator is internal proprietary API and may be removed in a future release
[2024-11-21T04:47:19.764Z] Validator.VAR_CODE_SIGNING,
[2024-11-21T04:47:19.764Z] ^
[2024-11-21T04:47:19.764Z] /home/jenkins/workspace/Test_openjdk17_hs_extended.openjdk_aarch64_linux_testList_0/aqa-tests/openjdk/openjdk-jdk/test/jdk/sun/security/ssl/X509TrustManagerImpl/distrust/Distrust.java:67: warning: Validator is internal proprietary API and may be removed in a future release
[2024-11-21T04:47:19.764Z] Validator v = Validator.getInstance(Validator.TYPE_PKIX,
[2024-11-21T04:47:19.764Z] ^
[2024-11-21T04:47:19.764Z] /home/jenkins/workspace/Test_openjdk17_hs_extended.openjdk_aarch64_linux_testList_0/aqa-tests/openjdk/openjdk-jdk/test/jdk/sun/security/ssl/X509TrustManagerImpl/distrust/Distrust.java:134: warning: ValidatorException is internal proprietary API and may be removed in a future release
[2024-11-21T04:47:19.764Z] if (ce instanceof ValidatorException) {
[2024-11-21T04:47:19.764Z] ^
[2024-11-21T04:47:19.764Z] /home/jenkins/workspace/Test_openjdk17_hs_extended.openjdk_aarch64_linux_testList_0/aqa-tests/openjdk/openjdk-jdk/test/jdk/sun/security/ssl/X509TrustManagerImpl/distrust/Distrust.java:135: warning: ValidatorException is internal proprietary API and may be removed in a future release
[2024-11-21T04:47:19.764Z] ValidatorException ve = (ValidatorException) ce;
[2024-11-21T04:47:19.764Z] ^
[2024-11-21T04:47:19.764Z] /home/jenkins/workspace/Test_openjdk17_hs_extended.openjdk_aarch64_linux_testList_0/aqa-tests/openjdk/openjdk-jdk/test/jdk/sun/security/ssl/X509TrustManagerImpl/distrust/Distrust.java:135: warning: ValidatorException is internal proprietary API and may be removed in a future release
[2024-11-21T04:47:19.764Z] ValidatorException ve = (ValidatorException) ce;
[2024-11-21T04:47:19.764Z] ^
[2024-11-21T04:47:19.764Z] /home/jenkins/workspace/Test_openjdk17_hs_extended.openjdk_aarch64_linux_testList_0/aqa-tests/openjdk/openjdk-jdk/test/jdk/sun/security/ssl/X509TrustManagerImpl/distrust/Distrust.java:136: warning: ValidatorException is internal proprietary API and may be removed in a future release
[2024-11-21T04:47:19.764Z] if (ve.getErrorType() != ValidatorException.T_UNTRUSTED_CERT) {
[2024-11-21T04:47:19.764Z] ^
[2024-11-21T04:47:19.764Z] Note: /home/jenkins/workspace/Test_openjdk17_hs_extended.openjdk_aarch64_linux_testList_0/aqa-tests/openjdk/openjdk-jdk/test/jdk/sun/security/ssl/X509TrustManagerImpl/distrust/Distrust.java uses or overrides a deprecated API.
[2024-11-21T04:47:19.764Z] Note: Recompile with -Xlint:deprecation for details.
[2024-11-21T04:47:19.764Z] Note: /home/jenkins/workspace/Test_openjdk17_hs_extended.openjdk_aarch64_linux_testList_0/aqa-tests/openjdk/openjdk-jdk/test/jdk/sun/security/ssl/X509TrustManagerImpl/distrust/Distrust.java uses unchecked or unsafe operations.
[2024-11-21T04:47:19.764Z] Note: Recompile with -Xlint:unchecked for details.
[2024-11-21T04:47:19.764Z] 10 warnings
[2024-11-21T04:47:19.764Z]
[2024-11-21T04:47:19.765Z] ACTION: main -- Failed. Execution failed: `main' threw exception: java.lang.RuntimeException: Unexpected exception: sun.security.validator.ValidatorException: PKIX path building failed: sun.security.provider.certpath.SunCertPathBuilderException: unable to find valid certification path to requested target
[2024-11-21T04:47:19.765Z] REASON: User specified action: run main/othervm Symantec after policyOn invalid
[2024-11-21T04:47:19.765Z] TIME: 6.696 seconds
[2024-11-21T04:47:19.765Z] messages:
[2024-11-21T04:47:19.765Z] command: main Symantec after policyOn invalid
[2024-11-21T04:47:19.765Z] reason: User specified action: run main/othervm Symantec after policyOn invalid
[2024-11-21T04:47:19.765Z] started: Thu Nov 21 04:47:01 UTC 2024
[2024-11-21T04:47:19.765Z] Mode: othervm [/othervm specified]
[2024-11-21T04:47:19.765Z] Additional options from @modules: --add-modules java.base --add-exports java.base/sun.security.validator=ALL-UNNAMED
[2024-11-21T04:47:19.765Z] finished: Thu Nov 21 04:47:08 UTC 2024
[2024-11-21T04:47:19.765Z] elapsed time (seconds): 6.696
[2024-11-21T04:47:19.765Z] configuration:
[2024-11-21T04:47:19.765Z] Boot Layer
[2024-11-21T04:47:19.765Z] add modules: java.base
[2024-11-21T04:47:19.765Z] add exports: java.base/sun.security.validator ALL-UNNAMED
[2024-11-21T04:47:19.765Z]
[2024-11-21T04:47:19.765Z] STDOUT:
[2024-11-21T04:47:19.765Z] STDERR:
[2024-11-21T04:47:19.765Z] Testing geotrustprimarycag2
[2024-11-21T04:47:19.765Z] sun.security.validator.ValidatorException: PKIX path building failed: sun.security.provider.certpath.SunCertPathBuilderException: unable to find valid certification path to requested target
[2024-11-21T04:47:19.765Z] at java.base/sun.security.validator.PKIXValidator.doBuild(PKIXValidator.java:439)
[2024-11-21T04:47:19.765Z] at java.base/sun.security.validator.PKIXValidator.engineValidate(PKIXValidator.java:306)
[2024-11-21T04:47:19.765Z] at java.base/sun.security.validator.Validator.validate(Validator.java:264)
[2024-11-21T04:47:19.765Z] at java.base/sun.security.ssl.X509TrustManagerImpl.checkTrusted(X509TrustManagerImpl.java:242)
[2024-11-21T04:47:19.765Z] at java.base/sun.security.ssl.X509TrustManagerImpl.checkServerTrusted(X509TrustManagerImpl.java:113)
[2024-11-21T04:47:19.765Z] at Distrust.testTM(Distrust.java:125)
[2024-11-21T04:47:19.765Z] at Distrust.testCertificateChain(Distrust.java:82)
[2024-11-21T04:47:19.765Z] at Symantec.main(Symantec.java:77)
[2024-11-21T04:47:19.765Z] at java.base/jdk.internal.reflect.NativeMethodAccessorImpl.invoke0(Native Method)
[2024-11-21T04:47:19.765Z] at java.base/jdk.internal.reflect.NativeMethodAccessorImpl.invoke(NativeMethodAccessorImpl.java:77)
[2024-11-21T04:47:19.765Z] at java.base/jdk.internal.reflect.DelegatingMethodAccessorImpl.invoke(DelegatingMethodAccessorImpl.java:43)
[2024-11-21T04:47:19.765Z] at java.base/java.lang.reflect.Method.invoke(Method.java:569)
[2024-11-21T04:47:19.765Z] at com.sun.javatest.regtest.agent.MainWrapper$MainTask.run(MainWrapper.java:138)
[2024-11-21T04:47:19.765Z] at java.base/java.lang.Thread.run(Thread.java:840)
[2024-11-21T04:47:19.765Z] Caused by: sun.security.provider.certpath.SunCertPathBuilderException: unable to find valid certification path to requested target
[2024-11-21T04:47:19.765Z] at java.base/sun.security.provider.certpath.SunCertPathBuilder.build(SunCertPathBuilder.java:148)
[2024-11-21T04:47:19.765Z] at java.base/sun.security.provider.certpath.SunCertPathBuilder.engineBuild(SunCertPathBuilder.java:129)
[2024-11-21T04:47:19.765Z] at java.base/java.security.cert.CertPathBuilder.build(CertPathBuilder.java:297)
[2024-11-21T04:47:19.765Z] at java.base/sun.security.validator.PKIXValidator.doBuild(PKIXValidator.java:434)
[2024-11-21T04:47:19.765Z] ... 13 more
[2024-11-21T04:47:19.765Z] java.lang.RuntimeException: Unexpected exception: sun.security.validator.ValidatorException: PKIX path building failed: sun.security.provider.certpath.SunCertPathBuilderException: unable to find valid certification path to requested target
[2024-11-21T04:47:19.765Z] at Distrust.testTM(Distrust.java:138)
[2024-11-21T04:47:19.765Z] at Distrust.testCertificateChain(Distrust.java:82)
[2024-11-21T04:47:19.765Z] at Symantec.main(Symantec.java:77)
[2024-11-21T04:47:19.765Z] at java.base/jdk.internal.reflect.NativeMethodAccessorImpl.invoke0(Native Method)
[2024-11-21T04:47:19.765Z] at java.base/jdk.internal.reflect.NativeMethodAccessorImpl.invoke(NativeMethodAccessorImpl.java:77)
[2024-11-21T04:47:19.765Z] at java.base/jdk.internal.reflect.DelegatingMethodAccessorImpl.invoke(DelegatingMethodAccessorImpl.java:43)
[2024-11-21T04:47:19.765Z] at java.base/java.lang.reflect.Method.invoke(Method.java:569)
[2024-11-21T04:47:19.765Z] at com.sun.javatest.regtest.agent.MainWrapper$MainTask.run(MainWrapper.java:138)
[2024-11-21T04:47:19.765Z] at java.base/java.lang.Thread.run(Thread.java:840)
[2024-11-21T04:47:19.765Z]
[2024-11-21T04:47:19.765Z] JavaTest Message: Test threw exception: java.lang.RuntimeException: Unexpected exception: sun.security.validator.ValidatorException: PKIX path building failed: sun.security.provider.certpath.SunCertPathBuilderException: unable to find valid certification path to requested target
[2024-11-21T04:47:19.765Z] JavaTest Message: shutting down test
[2024-11-21T04:47:19.765Z]
[2024-11-21T04:47:19.765Z] STATUS:Failed.`main' threw exception: java.lang.RuntimeException: Unexpected exception: sun.security.validator.ValidatorException: PKIX path building failed: sun.security.provider.certpath.SunCertPathBuilderException: unable to find valid certification path to requested target
[2024-11-21T04:47:19.765Z] rerun:
[2024-11-21T04:47:19.765Z] cd /home/jenkins/workspace/Test_openjdk17_hs_extended.openjdk_aarch64_linux_testList_0/aqa-tests/TKG/output_17321563695498/jdk_security3_1/work/scratch/2 && \
[2024-11-21T04:47:19.765Z] DISPLAY=:0 \
[2024-11-21T04:47:19.765Z] HOME=/home/jenkins \
[2024-11-21T04:47:19.765Z] LANG=C.utf8 \
[2024-11-21T04:47:19.765Z] PATH=/bin:/usr/bin:/usr/sbin \
[2024-11-21T04:47:19.765Z] CLASSPATH=/home/jenkins/workspace/Test_openjdk17_hs_extended.openjdk_aarch64_linux_testList_0/aqa-tests/TKG/output_17321563695498/jdk_security3_1/work/classes/0/sun/security/ssl/X509TrustManagerImpl/distrust/Symantec.d:/home/jenkins/workspace/Test_openjdk17_hs_extended.openjdk_aarch64_linux_testList_0/aqa-tests/openjdk/openjdk-jdk/test/jdk/sun/security/ssl/X509TrustManagerImpl/distrust:/home/jenkins/workspace/Test_openjdk17_hs_extended.openjdk_aarch64_linux_testList_0/aqa-tests/TKG/output_17321563695498/jdk_security3_1/work/classes/0/test/lib:/home/jenkins/workspace/Test_openjdk17_hs_extended.openjdk_aarch64_linux_testList_0/aqa-tests/openjdk/openjdk-jdk/test/lib:/home/jenkins/workspace/Test_openjdk17_hs_extended.openjdk_aarch64_linux_testList_0/jvmtest/openjdk/jtreg/lib/javatest.jar:/home/jenkins/workspace/Test_openjdk17_hs_extended.openjdk_aarch64_linux_testList_0/jvmtest/openjdk/jtreg/lib/jtreg.jar \
[2024-11-21T04:47:19.765Z] /home/jenkins/workspace/Test_openjdk17_hs_extended.openjdk_aarch64_linux_testList_0/jdkbinary/j2sdk-image/bin/java \
[2024-11-21T04:47:19.765Z] -Dtest.vm.opts='-ea -esa -Xmx512m -XX:-UseCompressedOops' \
[2024-11-21T04:47:19.765Z] -Dtest.tool.vm.opts='-J-ea -J-esa -J-Xmx512m -J-XX:-UseCompressedOops' \
[2024-11-21T04:47:19.765Z] -Dtest.compiler.opts= \
[2024-11-21T04:47:19.765Z] -Dtest.java.opts= \
[2024-11-21T04:47:19.765Z] -Dtest.jdk=/home/jenkins/workspace/Test_openjdk17_hs_extended.openjdk_aarch64_linux_testList_0/jdkbinary/j2sdk-image \
[2024-11-21T04:47:19.765Z] -Dcompile.jdk=/home/jenkins/workspace/Test_openjdk17_hs_extended.openjdk_aarch64_linux_testList_0/jdkbinary/j2sdk-image \
[2024-11-21T04:47:19.765Z] -Dtest.timeout.factor=8.0 \
[2024-11-21T04:47:19.765Z] -Dtest.nativepath=/home/jenkins/workspace/Test_openjdk17_hs_extended.openjdk_aarch64_linux_testList_0/jdkbinary/openjdk-test-image/jdk/jtreg/native \
[2024-11-21T04:47:19.765Z] -Dtest.root=/home/jenkins/workspace/Test_openjdk17_hs_extended.openjdk_aarch64_linux_testList_0/aqa-tests/openjdk/openjdk-jdk/test/jdk \
[2024-11-21T04:47:19.765Z] -Dtest.name=sun/security/ssl/X509TrustManagerImpl/distrust/Symantec.java \
[2024-11-21T04:47:19.765Z] -Dtest.file=/home/jenkins/workspace/Test_openjdk17_hs_extended.openjdk_aarch64_linux_testList_0/aqa-tests/openjdk/openjdk-jdk/test/jdk/sun/security/ssl/X509TrustManagerImpl/distrust/Symantec.java \
[2024-11-21T04:47:19.765Z] -Dtest.src=/home/jenkins/workspace/Test_openjdk17_hs_extended.openjdk_aarch64_linux_testList_0/aqa-tests/openjdk/openjdk-jdk/test/jdk/sun/security/ssl/X509TrustManagerImpl/distrust \
[2024-11-21T04:47:19.766Z] -Dtest.src.path=/home/jenkins/workspace/Test_openjdk17_hs_extended.openjdk_aarch64_linux_testList_0/aqa-tests/openjdk/openjdk-jdk/test/jdk/sun/security/ssl/X509TrustManagerImpl/distrust:/home/jenkins/workspace/Test_openjdk17_hs_extended.openjdk_aarch64_linux_testList_0/aqa-tests/openjdk/openjdk-jdk/test/lib \
[2024-11-21T04:47:19.766Z] -Dtest.classes=/home/jenkins/workspace/Test_openjdk17_hs_extended.openjdk_aarch64_linux_testList_0/aqa-tests/TKG/output_17321563695498/jdk_security3_1/work/classes/0/sun/security/ssl/X509TrustManagerImpl/distrust/Symantec.d \
[2024-11-21T04:47:19.766Z] -Dtest.class.path=/home/jenkins/workspace/Test_openjdk17_hs_extended.openjdk_aarch64_linux_testList_0/aqa-tests/TKG/output_17321563695498/jdk_security3_1/work/classes/0/sun/security/ssl/X509TrustManagerImpl/distrust/Symantec.d:/home/jenkins/workspace/Test_openjdk17_hs_extended.openjdk_aarch64_linux_testList_0/aqa-tests/TKG/output_17321563695498/jdk_security3_1/work/classes/0/test/lib \
[2024-11-21T04:47:19.766Z] -Dtest.class.path.prefix=/home/jenkins/workspace/Test_openjdk17_hs_extended.openjdk_aarch64_linux_testList_0/aqa-tests/TKG/output_17321563695498/jdk_security3_1/work/classes/0/sun/security/ssl/X509TrustManagerImpl/distrust/Symantec.d:/home/jenkins/workspace/Test_openjdk17_hs_extended.openjdk_aarch64_linux_testList_0/aqa-tests/openjdk/openjdk-jdk/test/jdk/sun/security/ssl/X509TrustManagerImpl/distrust:/home/jenkins/workspace/Test_openjdk17_hs_extended.openjdk_aarch64_linux_testList_0/aqa-tests/TKG/output_17321563695498/jdk_security3_1/work/classes/0/test/lib \
[2024-11-21T04:47:19.766Z] -Dtest.modules=java.base/sun.security.validator \
[2024-11-21T04:47:19.766Z] --add-modules java.base \
[2024-11-21T04:47:19.766Z] --add-exports java.base/sun.security.validator=ALL-UNNAMED \
[2024-11-21T04:47:19.766Z] -ea \
[2024-11-21T04:47:19.766Z] -esa \
[2024-11-21T04:47:19.766Z] -Xmx512m \
[2024-11-21T04:47:19.766Z] -XX:-UseCompressedOops \
[2024-11-21T04:47:19.766Z] -Djava.library.path=/home/jenkins/workspace/Test_openjdk17_hs_extended.openjdk_aarch64_linux_testList_0/jdkbinary/openjdk-test-image/jdk/jtreg/native \
[2024-11-21T04:47:19.766Z] com.sun.javatest.regtest.agent.MainWrapper /home/jenkins/workspace/Test_openjdk17_hs_extended.openjdk_aarch64_linux_testList_0/aqa-tests/TKG/output_17321563695498/jdk_security3_1/work/sun/security/ssl/X509TrustManagerImpl/distrust/Symantec.d/main.0.jta after policyOn invalid
[2024-11-21T04:47:19.766Z]
[2024-11-21T04:47:19.766Z] TEST RESULT: Failed. Execution failed: `main' threw exception: java.lang.RuntimeException: Unexpected exception: sun.security.validator.ValidatorException: PKIX path building failed: sun.security.provider.certpath.SunCertPathBuilderException: unable to find valid certification path to requested target
[2024-11-21T04:47:19.766Z] --------------------------------------------------
[2024-11-21T06:15:19.301Z] Test results: passed: 861; failed: 1; error: 1
[2024-11-21T06:16:26.666Z] Report written to /home/jenkins/workspace/Test_openjdk17_hs_extended.openjdk_aarch64_linux_testList_0/aqa-tests/TKG/output_17321563695498/jdk_security3_1/report/html/report.html
[2024-11-21T06:16:26.667Z] Results written to /home/jenkins/workspace/Test_openjdk17_hs_extended.openjdk_aarch64_linux_testList_0/aqa-tests/TKG/output_17321563695498/jdk_security3_1/work
[2024-11-21T06:16:26.667Z] Error: Some tests failed or other problems occurred.
[2024-11-21T06:16:26.667Z] -----------------------------------
[2024-11-21T06:16:26.667Z] jdk_security3_1_FAILED
[2024-11-21T06:16:26.667Z] -----------------------------------
[2024-11-21T06:16:26.667Z]
[2024-11-21T06:16:26.667Z] TEST TEARDOWN:
[2024-11-21T06:16:26.667Z] Nothing to be done for teardown.
[2024-11-21T06:16:26.667Z] jdk_security3_1 Finish Time: Thu Nov 21 06:16:20 2024 Epoch Time (ms): 1732169780224