PatMod_Unex_1
[2024-11-28T10:02:05.211Z] Running test PatMod_Unex_1 ...
[2024-11-28T10:02:05.550Z] ===============================================
[2024-11-28T10:02:05.550Z] PatMod_Unex_1 Start Time: Thu Nov 28 10:02:05 2024 Epoch Time (ms): 1732788125470
[2024-11-28T10:02:05.902Z] variation: Mode650
[2024-11-28T10:02:05.902Z] JVM_OPTIONS: -XX:-UseCompressedOops
[2024-11-28T10:02:05.902Z] { \
[2024-11-28T10:02:05.902Z] echo ""; echo "TEST SETUP:"; \
[2024-11-28T10:02:05.902Z] echo "Nothing to be done for setup."; \
[2024-11-28T10:02:05.902Z] mkdir -p "C:/jenkins/workspace/Test_openjdk17_hs_sanity.system_x86-64_windows_testList_1/aqa-tests/\\TKG\\output_17327862577023\\PatMod_Unex_1"; \
[2024-11-28T10:02:05.902Z] cd "C:/jenkins/workspace/Test_openjdk17_hs_sanity.system_x86-64_windows_testList_1/aqa-tests/\\TKG\\output_17327862577023\\PatMod_Unex_1"; \
[2024-11-28T10:02:05.902Z] echo ""; echo "TESTING:"; \
[2024-11-28T10:02:05.902Z] perl C:/jenkins/workspace/Test_openjdk17_hs_sanity.system_x86-64_windows_testList_1/aqa-tests///..//jvmtest\\system\\modularity/../\\STF\\stf.core\\scripts\\stf.pl -test-root="C:/jenkins/workspace/Test_openjdk17_hs_sanity.system_x86-64_windows_testList_1/aqa-tests///..//jvmtest\\system\\modularity/../\\STF;C:/jenkins/workspace/Test_openjdk17_hs_sanity.system_x86-64_windows_testList_1/aqa-tests///..//jvmtest\\system\\modularity/../\\aqa-systemtest""" -systemtest-prereqs="c:/jenkins/workspace/Test_openjdk17_hs_sanity.system_x86-64_windows_testList_1/../../testDependency/system_lib\\" -java-args=' -XX:-UseCompressedOops ' -results-root="C:/jenkins/workspace/Test_openjdk17_hs_sanity.system_x86-64_windows_testList_1/aqa-tests/\\TKG\\output_17327862577023\\PatMod_Unex_1" -test=PatModTest -test-args="variant=Unex"; \
[2024-11-28T10:02:05.902Z] if [ $? -eq 0 ]; then echo "-----------------------------------"; echo "PatMod_Unex_1""_PASSED"; echo "-----------------------------------"; cd C:/jenkins/workspace/Test_openjdk17_hs_sanity.system_x86-64_windows_testList_1/aqa-tests/; rm -f -r "C:/jenkins/workspace/Test_openjdk17_hs_sanity.system_x86-64_windows_testList_1/aqa-tests/\\TKG\\output_17327862577023\\PatMod_Unex_1"; else echo "-----------------------------------"; echo "PatMod_Unex_1""_FAILED"; echo "-----------------------------------"; fi; \
[2024-11-28T10:02:05.902Z] echo ""; echo "TEST TEARDOWN:"; \
[2024-11-28T10:02:05.902Z] echo "Nothing to be done for teardown."; \
[2024-11-28T10:02:05.902Z] } 2>&1 | tee -a "C:/jenkins/workspace/Test_openjdk17_hs_sanity.system_x86-64_windows_testList_1/aqa-tests/\\TKG\\output_17327862577023\\TestTargetResult";
[2024-11-28T10:02:05.902Z]
[2024-11-28T10:02:05.902Z] TEST SETUP:
[2024-11-28T10:02:05.902Z] Nothing to be done for setup.
[2024-11-28T10:02:05.902Z]
[2024-11-28T10:02:05.902Z] TESTING:
[2024-11-28T10:02:06.243Z] STF 10:02:05.946 - ========================= S T F =========================
[2024-11-28T10:02:06.243Z] systemtest-prereqs has been processed, and set to: c:/jenkins/testDependency/system_libRetrieving amount of free space on drive containing C:/jenkins/workspace/Test_openjdk17_hs_sanity.system_x86-64_windows_testList_1/aqa-tests/\TKG\output_17327862577023\PatMod_Unex_1
[2024-11-28T10:02:06.243Z] There is 128962 Mb free
[2024-11-28T10:02:06.243Z] STF 10:02:06.000 - ================== G E N E R A T I O N ==================
[2024-11-28T10:02:06.243Z] STF 10:02:06.003 - Checking JVM: c:/jenkins/workspace/Test_openjdk17_hs_sanity.system_x86-64_windows_testList_1/jdkbinary/j2sdk-image
[2024-11-28T10:02:06.243Z] STF 10:02:06.003 - Starting process to generate scripts: c:/jenkins/workspace/Test_openjdk17_hs_sanity.system_x86-64_windows_testList_1/jdkbinary/j2sdk-image/bin/java -Dlog4j.skipJansi=true -Djava.system.class.loader=net.adoptopenjdk.stf.runner.StfClassLoader -classpath c:/jenkins/workspace/Test_openjdk17_hs_sanity.system_x86-64_windows_testList_1/../../testDependency/system_lib\/log4j/log4j-api.jar;c:/jenkins/workspace/Test_openjdk17_hs_sanity.system_x86-64_windows_testList_1/../../testDependency/system_lib\/log4j/log4j-core.jar;C:/jenkins/workspace/Test_openjdk17_hs_sanity.system_x86-64_windows_testList_1/jvmtest/system/STF/stf.core/scripts/../bin net.adoptopenjdk.stf.runner.StfRunner -properties "C:/jenkins/workspace/Test_openjdk17_hs_sanity.system_x86-64_windows_testList_1/aqa-tests/\TKG\output_17327862577023\PatMod_Unex_1/20241128-100205-PatModTest/stf_parameters.properties, , C:/jenkins/workspace/Test_openjdk17_hs_sanity.system_x86-64_windows_testList_1/jvmtest/system/STF/stf.core/config/stf.properties" -testDir "C:/jenkins/workspace/Test_openjdk17_hs_sanity.system_x86-64_windows_testList_1/aqa-tests/\TKG\output_17327862577023\PatMod_Unex_1/20241128-100205-PatModTest"
[2024-11-28T10:02:06.243Z] GEN stderr OpenJDK 64-Bit Server VM warning: Archived non-system classes are disabled because the java.system.class.loader property is specified (value = "net.adoptopenjdk.stf.runner.StfClassLoader"). To use archived non-system classes, this property must not be set
[2024-11-28T10:02:07.347Z] GEN 10:02:06.950 - Found test. Project: 'openjdk.test.modularity' class: 'PatModTest.class' Dir: 'C:\jenkins\workspace\Test_openjdk17_hs_sanity.system_x86-64_windows_testList_1\jvmtest\system\aqa-systemtest\openjdk.test.modularity\bin'
[2024-11-28T10:02:07.347Z] GEN 10:02:06.969 - Found test. Project: 'openjdk.test.modularity' class: 'net.adoptopenjdk.test.modularity.PatModTest'
[2024-11-28T10:02:07.347Z] GEN Classpath directories used by project 'openjdk.test.modularity':
[2024-11-28T10:02:07.347Z] GEN C:\jenkins\workspace\Test_openjdk17_hs_sanity.system_x86-64_windows_testList_1\jvmtest\system\aqa-systemtest\openjdk.test.modularity\bin\common-mods\displayService
[2024-11-28T10:02:07.347Z] GEN C:\jenkins\workspace\Test_openjdk17_hs_sanity.system_x86-64_windows_testList_1\jvmtest\system\aqa-systemtest\openjdk.test.modularity\bin\common-mods\com.helper
[2024-11-28T10:02:07.347Z] GEN C:\jenkins\workspace\Test_openjdk17_hs_sanity.system_x86-64_windows_testList_1\jvmtest\system\aqa-systemtest\openjdk.test.modularity\bin\common-mods\displayServiceImpl1
[2024-11-28T10:02:07.347Z] GEN C:\jenkins\workspace\Test_openjdk17_hs_sanity.system_x86-64_windows_testList_1\jvmtest\system\aqa-systemtest\openjdk.test.modularity\bin\common-mods\com.discreet
[2024-11-28T10:02:07.347Z] GEN C:\jenkins\workspace\Test_openjdk17_hs_sanity.system_x86-64_windows_testList_1\jvmtest\system\aqa-systemtest\openjdk.test.modularity\bin\common-mods\com.hello
[2024-11-28T10:02:07.347Z] GEN C:\jenkins\workspace\Test_openjdk17_hs_sanity.system_x86-64_windows_testList_1\jvmtest\system\aqa-systemtest\openjdk.test.modularity\bin\common-mods\com.hola
[2024-11-28T10:02:07.347Z] GEN C:\jenkins\workspace\Test_openjdk17_hs_sanity.system_x86-64_windows_testList_1\jvmtest\system\aqa-systemtest\openjdk.test.modularity\bin\common-mods\displayServiceImpl2
[2024-11-28T10:02:07.347Z] GEN C:\jenkins\workspace\Test_openjdk17_hs_sanity.system_x86-64_windows_testList_1\jvmtest\system\aqa-systemtest\openjdk.test.modularity\bin\common-mods\com.hi
[2024-11-28T10:02:07.347Z] GEN C:\jenkins\workspace\Test_openjdk17_hs_sanity.system_x86-64_windows_testList_1\jvmtest\system\aqa-systemtest\openjdk.test.modularity\bin\common-override
[2024-11-28T10:02:07.347Z] GEN C:\jenkins\workspace\Test_openjdk17_hs_sanity.system_x86-64_windows_testList_1\jvmtest\system\aqa-systemtest\openjdk.test.modularity\bin\common-override-new
[2024-11-28T10:02:07.347Z] GEN C:\jenkins\workspace\Test_openjdk17_hs_sanity.system_x86-64_windows_testList_1\jvmtest\system\aqa-systemtest\openjdk.test.modularity\bin\common\displayServiceImpl3
[2024-11-28T10:02:07.347Z] GEN C:\jenkins\workspace\Test_openjdk17_hs_sanity.system_x86-64_windows_testList_1\jvmtest\system\aqa-systemtest\openjdk.test.modularity\bin\common\displayServiceImpl4
[2024-11-28T10:02:07.347Z] GEN C:\jenkins\workspace\Test_openjdk17_hs_sanity.system_x86-64_windows_testList_1\jvmtest\system\aqa-systemtest\openjdk.test.modularity\bin\common
[2024-11-28T10:02:07.347Z] GEN C:\jenkins\workspace\Test_openjdk17_hs_sanity.system_x86-64_windows_testList_1\jvmtest\system\aqa-systemtest\openjdk.test.modularity\bin\tests
[2024-11-28T10:02:07.347Z] GEN C:\\jenkins\\workspace\\Test_openjdk17_hs_sanity.system_x86-64_windows_testList_1\\jvmtest\\system\\aqa-systemtest\\openjdk.test.modularity\\bin
[2024-11-28T10:02:07.347Z] GEN C:\\jenkins\\workspace\\Test_openjdk17_hs_sanity.system_x86-64_windows_testList_1\\jvmtest\\system\\STF\\stf.core\\bin
[2024-11-28T10:02:07.347Z] GEN c:/jenkins/testDependency/system_lib/log4j/log4j-api.jar
[2024-11-28T10:02:07.347Z] GEN c:/jenkins/testDependency/system_lib/log4j/log4j-core.jar
[2024-11-28T10:02:07.347Z] GEN c:/jenkins/testDependency/system_lib/junit/junit.jar
[2024-11-28T10:02:07.347Z] GEN 10:02:07.221 - Using Mode NoOptions. Values = ''
[2024-11-28T10:02:07.674Z] GEN 10:02:07.311 -
[2024-11-28T10:02:07.674Z] GEN 10:02:07.311 - Test command summary:
[2024-11-28T10:02:07.674Z] GEN 10:02:07.311 - Step Stage Command Description
[2024-11-28T10:02:07.674Z] GEN 10:02:07.312 - -----+--------+-----------------+------------
[2024-11-28T10:02:07.674Z] GEN 10:02:07.312 - 1 execute jar Create com.hello jar
[2024-11-28T10:02:07.674Z] GEN 10:02:07.312 - 2 execute jar Create com.discreet jar
[2024-11-28T10:02:07.674Z] GEN 10:02:07.312 - 3 execute jar create java.xml.jar
[2024-11-28T10:02:07.674Z] GEN 10:02:07.312 - 4 execute Run java (Negative test) Include a new package that is not exported and ensure the public type cannot be accessed
[2024-11-28T10:02:07.674Z] GEN 10:02:07.312 - 5 execute count Check output
[2024-11-28T10:02:07.674Z] GEN 10:02:07.312 - 6 execute Run java Include a new package that is not exported and check if the public type can be accessed by adding --add-exports
[2024-11-28T10:02:07.674Z] STF 10:02:07.342 -
[2024-11-28T10:02:07.674Z] STF 10:02:07.342 - Script generation completed
[2024-11-28T10:02:07.674Z] STF 10:02:07.342 -
[2024-11-28T10:02:07.674Z] STF 10:02:07.343 -
[2024-11-28T10:02:07.674Z] STF 10:02:07.343 - ======================= S E T U P =======================
[2024-11-28T10:02:07.674Z] STF 10:02:07.343 - Running setup: perl C:/jenkins/workspace/Test_openjdk17_hs_sanity.system_x86-64_windows_testList_1/aqa-tests/\TKG\output_17327862577023\PatMod_Unex_1/20241128-100205-PatModTest/setUp.pl
[2024-11-28T10:02:07.674Z] STF 10:02:07.480 - SETUP stage completed
[2024-11-28T10:02:07.674Z] STF 10:02:07.497 -
[2024-11-28T10:02:07.674Z] STF 10:02:07.497 - ==================== E X E C U T E - ====================
[2024-11-28T10:02:07.674Z] STF 10:02:07.497 - Running execute: perl C:/jenkins/workspace/Test_openjdk17_hs_sanity.system_x86-64_windows_testList_1/aqa-tests/\TKG\output_17327862577023\PatMod_Unex_1/20241128-100205-PatModTest/execute.pl
[2024-11-28T10:02:08.002Z] STF 10:02:07.631 -
[2024-11-28T10:02:08.002Z] STF 10:02:07.631 - Java version
[2024-11-28T10:02:08.002Z] STF 10:02:07.631 - Running: c:/jenkins/workspace/Test_openjdk17_hs_sanity.system_x86-64_windows_testList_1/jdkbinary/j2sdk-image/bin/java -version
[2024-11-28T10:02:08.002Z] openjdk version "17.0.14-beta" 2025-01-21
[2024-11-28T10:02:08.002Z] OpenJDK Runtime Environment Temurin-17.0.14+5-202411272326 (build 17.0.14-beta+5-ea)
[2024-11-28T10:02:08.002Z] OpenJDK 64-Bit Server VM Temurin-17.0.14+5-202411272326 (build 17.0.14-beta+5-ea, mixed mode, sharing)
[2024-11-28T10:02:08.002Z] STF 10:02:07.726 -
[2024-11-28T10:02:08.002Z] STF 10:02:07.726 - +------ Step 1 - Create com.hello jar
[2024-11-28T10:02:08.002Z] STF 10:02:07.726 - | Create modular jar
[2024-11-28T10:02:08.002Z] STF 10:02:07.726 - | ModuleSpec: openjdk.test.modularity/bin/common-override/com.hello
[2024-11-28T10:02:08.002Z] STF 10:02:07.726 - | ModuleVersion: null
[2024-11-28T10:02:08.002Z] STF 10:02:07.726 - | MainClass: null
[2024-11-28T10:02:08.002Z] STF 10:02:07.726 - | HashModules: null
[2024-11-28T10:02:08.002Z] STF 10:02:07.726 - |
[2024-11-28T10:02:08.002Z] STF 10:02:07.726 - Running command: c:/jenkins/workspace/Test_openjdk17_hs_sanity.system_x86-64_windows_testList_1/jdkbinary/j2sdk-image/bin/jar --create --file C:/jenkins/workspace/Test_openjdk17_hs_sanity.system_x86-64_windows_testList_1/aqa-tests/TKG/output_17327862577023/PatMod_Unex_1/20241128-100205-PatModTest/modules/1.com.hello.jar -C C:\jenkins\workspace\Test_openjdk17_hs_sanity.system_x86-64_windows_testList_1\jvmtest\system\aqa-systemtest\openjdk.test.modularity\bin\common-override\com.hello .
[2024-11-28T10:02:08.002Z] STF 10:02:07.726 - Redirecting stderr to C:/jenkins/workspace/Test_openjdk17_hs_sanity.system_x86-64_windows_testList_1/aqa-tests/TKG/output_17327862577023/PatMod_Unex_1/20241128-100205-PatModTest/results/1.CMJ.stderr
[2024-11-28T10:02:08.002Z] STF 10:02:07.726 - Redirecting stdout to C:/jenkins/workspace/Test_openjdk17_hs_sanity.system_x86-64_windows_testList_1/aqa-tests/TKG/output_17327862577023/PatMod_Unex_1/20241128-100205-PatModTest/results/1.CMJ.stdout
[2024-11-28T10:02:08.002Z] STF 10:02:07.754 - Monitoring processes: CMJ
[2024-11-28T10:02:08.325Z] STF 10:02:08.023 - Monitoring Report Summary:
[2024-11-28T10:02:08.325Z] STF 10:02:08.023 - o Process CMJ ended with the expected exit code (0)
[2024-11-28T10:02:08.325Z] STF 10:02:08.023 - Created modular jar: 1.com.hello.jar
[2024-11-28T10:02:08.325Z] STF 10:02:08.024 -
[2024-11-28T10:02:08.325Z] STF 10:02:08.024 - +------ Step 2 - Create com.discreet jar
[2024-11-28T10:02:08.325Z] STF 10:02:08.024 - | Create modular jar
[2024-11-28T10:02:08.325Z] STF 10:02:08.024 - | ModuleSpec: openjdk.test.modularity/bin/common-override/com.discreet
[2024-11-28T10:02:08.325Z] STF 10:02:08.024 - | ModuleVersion: null
[2024-11-28T10:02:08.325Z] STF 10:02:08.024 - | MainClass: null
[2024-11-28T10:02:08.325Z] STF 10:02:08.024 - | HashModules: null
[2024-11-28T10:02:08.325Z] STF 10:02:08.024 - |
[2024-11-28T10:02:08.325Z] STF 10:02:08.024 - Running command: c:/jenkins/workspace/Test_openjdk17_hs_sanity.system_x86-64_windows_testList_1/jdkbinary/j2sdk-image/bin/jar --create --file C:/jenkins/workspace/Test_openjdk17_hs_sanity.system_x86-64_windows_testList_1/aqa-tests/TKG/output_17327862577023/PatMod_Unex_1/20241128-100205-PatModTest/modules/2.com.discreet.jar -C C:\jenkins\workspace\Test_openjdk17_hs_sanity.system_x86-64_windows_testList_1\jvmtest\system\aqa-systemtest\openjdk.test.modularity\bin\common-override\com.discreet .
[2024-11-28T10:02:08.325Z] STF 10:02:08.024 - Redirecting stderr to C:/jenkins/workspace/Test_openjdk17_hs_sanity.system_x86-64_windows_testList_1/aqa-tests/TKG/output_17327862577023/PatMod_Unex_1/20241128-100205-PatModTest/results/2.CMJ.stderr
[2024-11-28T10:02:08.325Z] STF 10:02:08.024 - Redirecting stdout to C:/jenkins/workspace/Test_openjdk17_hs_sanity.system_x86-64_windows_testList_1/aqa-tests/TKG/output_17327862577023/PatMod_Unex_1/20241128-100205-PatModTest/results/2.CMJ.stdout
[2024-11-28T10:02:08.325Z] STF 10:02:08.031 - Monitoring processes: CMJ
[2024-11-28T10:02:08.647Z] STF 10:02:08.285 - Monitoring Report Summary:
[2024-11-28T10:02:08.647Z] STF 10:02:08.285 - o Process CMJ ended with the expected exit code (0)
[2024-11-28T10:02:08.647Z] STF 10:02:08.285 - Created modular jar: 2.com.discreet.jar
[2024-11-28T10:02:08.647Z] STF 10:02:08.285 -
[2024-11-28T10:02:08.647Z] STF 10:02:08.285 - +------ Step 3 - create java.xml.jar
[2024-11-28T10:02:08.647Z] STF 10:02:08.285 - | Create modular jar
[2024-11-28T10:02:08.647Z] STF 10:02:08.285 - | ModuleSpec: openjdk.test.modularity/bin/common-override/java.xml
[2024-11-28T10:02:08.647Z] STF 10:02:08.285 - | ModuleVersion: null
[2024-11-28T10:02:08.647Z] STF 10:02:08.286 - | MainClass: null
[2024-11-28T10:02:08.647Z] STF 10:02:08.286 - | HashModules: null
[2024-11-28T10:02:08.647Z] STF 10:02:08.286 - |
[2024-11-28T10:02:08.647Z] STF 10:02:08.286 - Running command: c:/jenkins/workspace/Test_openjdk17_hs_sanity.system_x86-64_windows_testList_1/jdkbinary/j2sdk-image/bin/jar --create --file C:/jenkins/workspace/Test_openjdk17_hs_sanity.system_x86-64_windows_testList_1/aqa-tests/TKG/output_17327862577023/PatMod_Unex_1/20241128-100205-PatModTest/modules/3.java.xml.jar -C C:\jenkins\workspace\Test_openjdk17_hs_sanity.system_x86-64_windows_testList_1\jvmtest\system\aqa-systemtest\openjdk.test.modularity\bin\common-override\java.xml .
[2024-11-28T10:02:08.647Z] STF 10:02:08.286 - Redirecting stderr to C:/jenkins/workspace/Test_openjdk17_hs_sanity.system_x86-64_windows_testList_1/aqa-tests/TKG/output_17327862577023/PatMod_Unex_1/20241128-100205-PatModTest/results/3.CMJ.stderr
[2024-11-28T10:02:08.647Z] STF 10:02:08.286 - Redirecting stdout to C:/jenkins/workspace/Test_openjdk17_hs_sanity.system_x86-64_windows_testList_1/aqa-tests/TKG/output_17327862577023/PatMod_Unex_1/20241128-100205-PatModTest/results/3.CMJ.stdout
[2024-11-28T10:02:08.647Z] STF 10:02:08.292 - Monitoring processes: CMJ
[2024-11-28T10:02:08.647Z] STF 10:02:08.564 - Monitoring Report Summary:
[2024-11-28T10:02:08.647Z] STF 10:02:08.564 - o Process CMJ ended with the expected exit code (0)
[2024-11-28T10:02:08.647Z] STF 10:02:08.565 - Created modular jar: 3.java.xml.jar
[2024-11-28T10:02:08.647Z] STF 10:02:08.565 -
[2024-11-28T10:02:08.647Z] STF 10:02:08.565 - +------ Step 4 - (Negative test) Include a new package that is not exported and ensure the public type cannot be accessed
[2024-11-28T10:02:08.647Z] STF 10:02:08.565 - | Run foreground process
[2024-11-28T10:02:08.647Z] STF 10:02:08.565 - | Program: c:/jenkins/workspace/Test_openjdk17_hs_sanity.system_x86-64_windows_testList_1/jdkbinary/j2sdk-image/bin/java
[2024-11-28T10:02:08.647Z] STF 10:02:08.565 - | Mnemonic: OT3
[2024-11-28T10:02:08.647Z] STF 10:02:08.565 - | Echo: ECHO_ON
[2024-11-28T10:02:08.647Z] STF 10:02:08.565 - | Expectation: NON_ZERO_EXIT [1] within 1m
[2024-11-28T10:02:08.647Z] STF 10:02:08.565 - |
[2024-11-28T10:02:08.647Z] STF 10:02:08.565 - Running command: c:/jenkins/workspace/Test_openjdk17_hs_sanity.system_x86-64_windows_testList_1/jdkbinary/j2sdk-image/bin/java --add-reads com.test=ALL-UNNAMED --module-path C:\jenkins\workspace\Test_openjdk17_hs_sanity.system_x86-64_windows_testList_1\jvmtest\system\aqa-systemtest\openjdk.test.modularity\bin\common-mods;C:\jenkins\workspace\Test_openjdk17_hs_sanity.system_x86-64_windows_testList_1\jvmtest\system\aqa-systemtest\openjdk.test.modularity\bin\tests --add-modules=com.test --patch-module com.hello=C:/jenkins/workspace/Test_openjdk17_hs_sanity.system_x86-64_windows_testList_1/aqa-tests/TKG/output_17327862577023/PatMod_Unex_1/20241128-100205-PatModTest/modules/1.com.hello.jar -XX:-UseCompressedOops -classpath c:/jenkins/testDependency/system_lib/junit/junit.jar;c:/jenkins/testDependency/system_lib/junit/hamcrest-core.jar org.junit.runner.JUnitCore net.adoptopenjdk.test.modularity.junit.TestOverrideUsingAppModuleAndNewPackage
[2024-11-28T10:02:08.647Z] STF 10:02:08.565 - Redirecting stderr to C:/jenkins/workspace/Test_openjdk17_hs_sanity.system_x86-64_windows_testList_1/aqa-tests/TKG/output_17327862577023/PatMod_Unex_1/20241128-100205-PatModTest/results/4.OT3.stderr
[2024-11-28T10:02:08.647Z] STF 10:02:08.565 - Redirecting stdout to C:/jenkins/workspace/Test_openjdk17_hs_sanity.system_x86-64_windows_testList_1/aqa-tests/TKG/output_17327862577023/PatMod_Unex_1/20241128-100205-PatModTest/results/4.OT3.stdout
[2024-11-28T10:02:08.647Z] STF 10:02:08.573 - Monitoring processes: OT3
[2024-11-28T10:02:08.972Z] OT3 stderr WARNING: module-info.class ignored in patch: C:\jenkins\workspace\Test_openjdk17_hs_sanity.system_x86-64_windows_testList_1\aqa-tests\TKG\output_17327862577023\PatMod_Unex_1\20241128-100205-PatModTest\modules\1.com.hello.jar
[2024-11-28T10:02:08.972Z] OT3 JUnit version 4.12
[2024-11-28T10:02:09.298Z] OT3 .E
[2024-11-28T10:02:09.298Z] OT3 Time: 0.008
[2024-11-28T10:02:09.298Z] OT3 There was 1 failure:
[2024-11-28T10:02:09.298Z] OT3 1) testOverrideUsingAppModuleAndNewPackage(net.adoptopenjdk.test.modularity.junit.TestOverrideUsingAppModuleAndNewPackage)
[2024-11-28T10:02:09.298Z] OT3 java.lang.IllegalAccessException: class net.adoptopenjdk.test.modularity.junit.TestOverrideUsingAppModuleAndNewPackage (in module com.test) cannot access class adoptopenjdk.test.modularity.hellonew.HelloNew (in module com.hello) because module com.hello does not export adoptopenjdk.test.modularity.hellonew to module com.test
[2024-11-28T10:02:09.298Z] OT3 at java.base/jdk.internal.reflect.Reflection.newIllegalAccessException(Reflection.java:392)
[2024-11-28T10:02:09.298Z] OT3 at java.base/java.lang.reflect.AccessibleObject.checkAccess(AccessibleObject.java:674)
[2024-11-28T10:02:09.298Z] OT3 at java.base/java.lang.reflect.Constructor.newInstanceWithCaller(Constructor.java:490)
[2024-11-28T10:02:09.298Z] OT3 at java.base/java.lang.reflect.Constructor.newInstance(Constructor.java:481)
[2024-11-28T10:02:09.298Z] OT3 at com.test/net.adoptopenjdk.test.modularity.junit.TestOverrideUsingAppModuleAndNewPackage.testOverrideUsingAppModuleAndNewPackage(TestOverrideUsingAppModuleAndNewPackage.java:31)
[2024-11-28T10:02:09.298Z] OT3 at java.base/jdk.internal.reflect.NativeMethodAccessorImpl.invoke0(Native Method)
[2024-11-28T10:02:09.298Z] OT3 at java.base/jdk.internal.reflect.NativeMethodAccessorImpl.invoke(NativeMethodAccessorImpl.java:77)
[2024-11-28T10:02:09.298Z] OT3 at java.base/jdk.internal.reflect.DelegatingMethodAccessorImpl.invoke(DelegatingMethodAccessorImpl.java:43)
[2024-11-28T10:02:09.298Z] OT3 at java.base/java.lang.reflect.Method.invoke(Method.java:569)
[2024-11-28T10:02:09.298Z] OT3 at org.junit.runners.model.FrameworkMethod$1.runReflectiveCall(FrameworkMethod.java:50)
[2024-11-28T10:02:09.298Z] OT3 at org.junit.internal.runners.model.ReflectiveCallable.run(ReflectiveCallable.java:12)
[2024-11-28T10:02:09.298Z] OT3 at org.junit.runners.model.FrameworkMethod.invokeExplosively(FrameworkMethod.java:47)
[2024-11-28T10:02:09.298Z] OT3 at org.junit.internal.runners.statements.InvokeMethod.evaluate(InvokeMethod.java:17)
[2024-11-28T10:02:09.298Z] OT3 at org.junit.runners.ParentRunner.runLeaf(ParentRunner.java:325)
[2024-11-28T10:02:09.298Z] OT3 at org.junit.runners.BlockJUnit4ClassRunner.runChild(BlockJUnit4ClassRunner.java:78)
[2024-11-28T10:02:09.298Z] OT3 at org.junit.runners.BlockJUnit4ClassRunner.runChild(BlockJUnit4ClassRunner.java:57)
[2024-11-28T10:02:09.298Z] OT3 at org.junit.runners.ParentRunner$3.run(ParentRunner.java:290)
[2024-11-28T10:02:09.298Z] OT3 at org.junit.runners.ParentRunner$1.schedule(ParentRunner.java:71)
[2024-11-28T10:02:09.298Z] OT3 at org.junit.runners.ParentRunner.runChildren(ParentRunner.java:288)
[2024-11-28T10:02:09.298Z] OT3 at org.junit.runners.ParentRunner.access$000(ParentRunner.java:58)
[2024-11-28T10:02:09.298Z] OT3 at org.junit.runners.ParentRunner$2.evaluate(ParentRunner.java:268)
[2024-11-28T10:02:09.298Z] OT3 at org.junit.runners.ParentRunner.run(ParentRunner.java:363)
[2024-11-28T10:02:09.299Z] OT3 at org.junit.runners.Suite.runChild(Suite.java:128)
[2024-11-28T10:02:09.299Z] OT3 at org.junit.runners.Suite.runChild(Suite.java:27)
[2024-11-28T10:02:09.299Z] OT3 at org.junit.runners.ParentRunner$3.run(ParentRunner.java:290)
[2024-11-28T10:02:09.299Z] OT3 at org.junit.runners.ParentRunner$1.schedule(ParentRunner.java:71)
[2024-11-28T10:02:09.299Z] OT3 at org.junit.runners.ParentRunner.runChildren(ParentRunner.java:288)
[2024-11-28T10:02:09.299Z] OT3 at org.junit.runners.ParentRunner.access$000(ParentRunner.java:58)
[2024-11-28T10:02:09.299Z] OT3 at org.junit.runners.ParentRunner$2.evaluate(ParentRunner.java:268)
[2024-11-28T10:02:09.299Z] OT3 at org.junit.runners.ParentRunner.run(ParentRunner.java:363)
[2024-11-28T10:02:09.299Z] OT3 at org.junit.runner.JUnitCore.run(JUnitCore.java:137)
[2024-11-28T10:02:09.299Z] OT3 at org.junit.runner.JUnitCore.run(JUnitCore.java:115)
[2024-11-28T10:02:09.299Z] OT3 at org.junit.runner.JUnitCore.runMain(JUnitCore.java:77)
[2024-11-28T10:02:09.299Z] OT3 at org.junit.runner.JUnitCore.main(JUnitCore.java:36)
[2024-11-28T10:02:09.299Z] OT3
[2024-11-28T10:02:09.299Z] OT3 FAILURES!!!
[2024-11-28T10:02:09.299Z] OT3 Tests run: 1, Failures: 1
[2024-11-28T10:02:09.299Z] OT3
[2024-11-28T10:02:09.299Z] STF 10:02:08.992 - Monitoring Report Summary:
[2024-11-28T10:02:09.299Z] STF 10:02:08.992 - o Process OT3 ended with the expected exit code (1)
[2024-11-28T10:02:09.299Z] STF 10:02:08.993 -
[2024-11-28T10:02:09.299Z] STF 10:02:08.993 - +------ Step 5 - Check output
[2024-11-28T10:02:09.299Z] STF 10:02:08.993 - | Count file matches
[2024-11-28T10:02:09.299Z] STF 10:02:08.993 - | TargetFile: C:/jenkins/workspace/Test_openjdk17_hs_sanity.system_x86-64_windows_testList_1/aqa-tests/TKG/output_17327862577023/PatMod_Unex_1/20241128-100205-PatModTest/results/4.OT3.stdout
[2024-11-28T10:02:09.299Z] STF 10:02:08.993 - | ExpectedNumMatches: 1
[2024-11-28T10:02:09.299Z] STF 10:02:08.993 - | SearchStrings: ["java.lang.IllegalAccessException"]
[2024-11-28T10:02:09.299Z] STF 10:02:08.993 - |
[2024-11-28T10:02:09.299Z] STF 10:02:08.993 - Found 1 instances of ["java.lang.IllegalAccessException"]
[2024-11-28T10:02:09.299Z] STF 10:02:08.993 -
[2024-11-28T10:02:09.299Z] STF 10:02:08.993 - +------ Step 6 - Include a new package that is not exported and check if the public type can be accessed by adding --add-exports
[2024-11-28T10:02:09.299Z] STF 10:02:08.993 - | Run foreground process
[2024-11-28T10:02:09.299Z] STF 10:02:08.993 - | Program: c:/jenkins/workspace/Test_openjdk17_hs_sanity.system_x86-64_windows_testList_1/jdkbinary/j2sdk-image/bin/java
[2024-11-28T10:02:09.299Z] STF 10:02:08.993 - | Mnemonic: OT4
[2024-11-28T10:02:09.299Z] STF 10:02:08.993 - | Echo: ECHO_ON
[2024-11-28T10:02:09.299Z] STF 10:02:08.993 - | Expectation: CLEAN_RUN within 1m
[2024-11-28T10:02:09.299Z] STF 10:02:08.993 - |
[2024-11-28T10:02:09.299Z] STF 10:02:08.993 - Running command: c:/jenkins/workspace/Test_openjdk17_hs_sanity.system_x86-64_windows_testList_1/jdkbinary/j2sdk-image/bin/java --add-reads com.test=ALL-UNNAMED --module-path C:\jenkins\workspace\Test_openjdk17_hs_sanity.system_x86-64_windows_testList_1\jvmtest\system\aqa-systemtest\openjdk.test.modularity\bin\common-mods;C:\jenkins\workspace\Test_openjdk17_hs_sanity.system_x86-64_windows_testList_1\jvmtest\system\aqa-systemtest\openjdk.test.modularity\bin\tests --add-modules=com.test --add-exports com.hello/adoptopenjdk.test.modularity.hellonew=com.test --patch-module com.hello=C:/jenkins/workspace/Test_openjdk17_hs_sanity.system_x86-64_windows_testList_1/aqa-tests/TKG/output_17327862577023/PatMod_Unex_1/20241128-100205-PatModTest/modules/1.com.hello.jar -XX:-UseCompressedOops -classpath c:/jenkins/testDependency/system_lib/junit/junit.jar;c:/jenkins/testDependency/system_lib/junit/hamcrest-core.jar org.junit.runner.JUnitCore net.adoptopenjdk.test.modularity.junit.TestOverrideUsingAppModuleAndNewPackage
[2024-11-28T10:02:09.299Z] STF 10:02:08.993 - Redirecting stderr to C:/jenkins/workspace/Test_openjdk17_hs_sanity.system_x86-64_windows_testList_1/aqa-tests/TKG/output_17327862577023/PatMod_Unex_1/20241128-100205-PatModTest/results/6.OT4.stderr
[2024-11-28T10:02:09.299Z] STF 10:02:08.993 - Redirecting stdout to C:/jenkins/workspace/Test_openjdk17_hs_sanity.system_x86-64_windows_testList_1/aqa-tests/TKG/output_17327862577023/PatMod_Unex_1/20241128-100205-PatModTest/results/6.OT4.stdout
[2024-11-28T10:02:09.299Z] STF 10:02:09.000 - Monitoring processes: OT4
[2024-11-28T10:02:09.299Z] OT4 stderr WARNING: module-info.class ignored in patch: C:\jenkins\workspace\Test_openjdk17_hs_sanity.system_x86-64_windows_testList_1\aqa-tests\TKG\output_17327862577023\PatMod_Unex_1\20241128-100205-PatModTest\modules\1.com.hello.jar
[2024-11-28T10:02:09.623Z] OT4 JUnit version 4.12
[2024-11-28T10:02:09.623Z] OT4 .
[2024-11-28T10:02:09.623Z] OT4 Time: 0.005
[2024-11-28T10:02:09.623Z] OT4
[2024-11-28T10:02:09.623Z] OT4 OK (1 test)
[2024-11-28T10:02:09.623Z] OT4
[2024-11-28T10:02:09.623Z] STF 10:02:09.398 - Monitoring Report Summary:
[2024-11-28T10:02:09.623Z] STF 10:02:09.398 - o Process OT4 ended with the expected exit code (0)
[2024-11-28T10:02:09.623Z] STF 10:02:09.398 - EXECUTE stage completed
[2024-11-28T10:02:09.623Z] STF 10:02:09.447 -
[2024-11-28T10:02:09.623Z] STF 10:02:09.447 - ==================== T E A R D O W N ====================
[2024-11-28T10:02:09.623Z] STF 10:02:09.447 - Running teardown: perl C:/jenkins/workspace/Test_openjdk17_hs_sanity.system_x86-64_windows_testList_1/aqa-tests/\TKG\output_17327862577023\PatMod_Unex_1/20241128-100205-PatModTest/tearDown.pl
[2024-11-28T10:02:09.934Z] STF 10:02:09.589 - TEARDOWN stage completed
[2024-11-28T10:02:09.934Z] STF 10:02:09.608 -
[2024-11-28T10:02:09.934Z] STF 10:02:09.608 - ===================== R E S U L T S =====================
[2024-11-28T10:02:09.934Z] STF 10:02:09.608 - Stage results:
[2024-11-28T10:02:09.934Z] STF 10:02:09.608 - setUp: pass
[2024-11-28T10:02:09.934Z] STF 10:02:09.608 - execute: pass
[2024-11-28T10:02:09.934Z] STF 10:02:09.608 - teardown: pass
[2024-11-28T10:02:09.934Z] STF 10:02:09.608 -
[2024-11-28T10:02:09.934Z] STF 10:02:09.608 - Overall result: PASSED
[2024-11-28T10:02:09.934Z] -----------------------------------
[2024-11-28T10:02:09.934Z] PatMod_Unex_1_PASSED
[2024-11-28T10:02:09.934Z] -----------------------------------
[2024-11-28T10:02:09.934Z]
[2024-11-28T10:02:09.934Z] TEST TEARDOWN:
[2024-11-28T10:02:09.934Z] Nothing to be done for teardown.
[2024-11-28T10:02:09.934Z] PatMod_Unex_1 Finish Time: Thu Nov 28 10:02:09 2024 Epoch Time (ms): 1732788129779