PatMod_Unex_1
[2025-02-06T17:23:31.125Z] Running test PatMod_Unex_1 ...
[2025-02-06T17:23:31.125Z] ===============================================
[2025-02-06T17:23:31.125Z] PatMod_Unex_1 Start Time: Thu Feb 6 17:23:30 2025 Epoch Time (ms): 1738862610731
[2025-02-06T17:23:31.125Z] variation: Mode650
[2025-02-06T17:23:31.125Z] JVM_OPTIONS: -XX:-UseCompressedOops
[2025-02-06T17:23:31.125Z] { \
[2025-02-06T17:23:31.125Z] echo ""; echo "TEST SETUP:"; \
[2025-02-06T17:23:31.125Z] echo "Nothing to be done for setup."; \
[2025-02-06T17:23:31.125Z] mkdir -p "/home/jenkins/workspace/Test_openjdk11_hs_sanity.system_s390x_linux_testList_2/aqa-tests/TKG/../TKG/output_1738861907471/PatMod_Unex_1"; \
[2025-02-06T17:23:31.125Z] cd "/home/jenkins/workspace/Test_openjdk11_hs_sanity.system_s390x_linux_testList_2/aqa-tests/TKG/../TKG/output_1738861907471/PatMod_Unex_1"; \
[2025-02-06T17:23:31.125Z] echo ""; echo "TESTING:"; \
[2025-02-06T17:23:31.125Z] perl /home/jenkins/workspace/Test_openjdk11_hs_sanity.system_s390x_linux_testList_2/aqa-tests/TKG/../../jvmtest/system/modularity/..//STF/stf.core/scripts/stf.pl -test-root="/home/jenkins/workspace/Test_openjdk11_hs_sanity.system_s390x_linux_testList_2/aqa-tests/TKG/../../jvmtest/system/modularity/..//STF;/home/jenkins/workspace/Test_openjdk11_hs_sanity.system_s390x_linux_testList_2/aqa-tests/TKG/../../jvmtest/system/modularity/..//aqa-systemtest""" -systemtest-prereqs="/home/jenkins/workspace/Test_openjdk11_hs_sanity.system_s390x_linux_testList_2/../../testDependency/system_lib/" -java-args=' -XX:-UseCompressedOops ' -results-root="/home/jenkins/workspace/Test_openjdk11_hs_sanity.system_s390x_linux_testList_2/aqa-tests/TKG/../TKG/output_1738861907471/PatMod_Unex_1" -test=PatModTest -test-args="variant=Unex"; \
[2025-02-06T17:23:31.126Z] if [ $? -eq 0 ]; then echo "-----------------------------------"; echo "PatMod_Unex_1""_PASSED"; echo "-----------------------------------"; cd /home/jenkins/workspace/Test_openjdk11_hs_sanity.system_s390x_linux_testList_2/aqa-tests/TKG/..; rm -f -r "/home/jenkins/workspace/Test_openjdk11_hs_sanity.system_s390x_linux_testList_2/aqa-tests/TKG/../TKG/output_1738861907471/PatMod_Unex_1"; else echo "-----------------------------------"; echo "PatMod_Unex_1""_FAILED"; echo "-----------------------------------"; fi; \
[2025-02-06T17:23:31.126Z] echo ""; echo "TEST TEARDOWN:"; \
[2025-02-06T17:23:31.126Z] echo "Nothing to be done for teardown."; \
[2025-02-06T17:23:31.126Z] } 2>&1 | tee -a "/home/jenkins/workspace/Test_openjdk11_hs_sanity.system_s390x_linux_testList_2/aqa-tests/TKG/../TKG/output_1738861907471/TestTargetResult";
[2025-02-06T17:23:31.126Z]
[2025-02-06T17:23:31.126Z] TEST SETUP:
[2025-02-06T17:23:31.126Z] Nothing to be done for setup.
[2025-02-06T17:23:31.126Z]
[2025-02-06T17:23:31.126Z] TESTING:
[2025-02-06T17:23:31.126Z] STF 17:23:30.957 - ========================= S T F =========================
[2025-02-06T17:23:31.126Z] systemtest-prereqs has been processed, and set to: /home/jenkins/testDependency/system_libRetrieving amount of free space on drive containing /home/jenkins/workspace/Test_openjdk11_hs_sanity.system_s390x_linux_testList_2/aqa-tests/TKG/../TKG/output_1738861907471/PatMod_Unex_1
[2025-02-06T17:23:31.126Z] There is 159476 Mb free
[2025-02-06T17:23:31.126Z] STF 17:23:30.973 - ================== G E N E R A T I O N ==================
[2025-02-06T17:23:31.126Z] STF 17:23:30.973 - Checking JVM: /home/jenkins/workspace/Test_openjdk11_hs_sanity.system_s390x_linux_testList_2/jdkbinary/j2sdk-image
[2025-02-06T17:23:31.126Z] STF 17:23:30.974 - Starting process to generate scripts: /home/jenkins/workspace/Test_openjdk11_hs_sanity.system_s390x_linux_testList_2/jdkbinary/j2sdk-image/bin/java -Dlog4j.skipJansi=true -Djava.system.class.loader=net.adoptopenjdk.stf.runner.StfClassLoader -Dload.agent.path=/home/jenkins/workspace/Test_openjdk11_hs_sanity.system_s390x_linux_testList_2/jvmtest/system/STF/stf.core/scripts/../../stf.load/bin/stf.load.jar -classpath /home/jenkins/workspace/Test_openjdk11_hs_sanity.system_s390x_linux_testList_2/../../testDependency/system_lib//asm/asm.jar:/home/jenkins/workspace/Test_openjdk11_hs_sanity.system_s390x_linux_testList_2/../../testDependency/system_lib//asm/asm-commons.jar:/home/jenkins/workspace/Test_openjdk11_hs_sanity.system_s390x_linux_testList_2/../../testDependency/system_lib//log4j/log4j-api.jar:/home/jenkins/workspace/Test_openjdk11_hs_sanity.system_s390x_linux_testList_2/../../testDependency/system_lib//log4j/log4j-core.jar:/home/jenkins/workspace/Test_openjdk11_hs_sanity.system_s390x_linux_testList_2/jvmtest/system/STF/stf.core/scripts/../bin net.adoptopenjdk.stf.runner.StfRunner -properties "/home/jenkins/workspace/Test_openjdk11_hs_sanity.system_s390x_linux_testList_2/aqa-tests/TKG/../TKG/output_1738861907471/PatMod_Unex_1/20250206-172330-PatModTest/stf_parameters.properties, , /home/jenkins/workspace/Test_openjdk11_hs_sanity.system_s390x_linux_testList_2/jvmtest/system/STF/stf.core/config/stf.properties" -testDir "/home/jenkins/workspace/Test_openjdk11_hs_sanity.system_s390x_linux_testList_2/aqa-tests/TKG/../TKG/output_1738861907471/PatMod_Unex_1/20250206-172330-PatModTest"
[2025-02-06T17:23:35.859Z] GEN 17:23:35.109 - Found test. Project: 'openjdk.test.modularity' class: 'PatModTest.class' Dir: '/home/jenkins/workspace/Test_openjdk11_hs_sanity.system_s390x_linux_testList_2/jvmtest/system/aqa-systemtest/openjdk.test.modularity/bin'
[2025-02-06T17:23:35.859Z] GEN 17:23:35.131 - Found test. Project: 'openjdk.test.modularity' class: 'net.adoptopenjdk.test.modularity.PatModTest'
[2025-02-06T17:23:37.087Z] GEN Classpath directories used by project 'openjdk.test.modularity':
[2025-02-06T17:23:37.087Z] GEN /home/jenkins/workspace/Test_openjdk11_hs_sanity.system_s390x_linux_testList_2/jvmtest/system/aqa-systemtest/openjdk.test.modularity/bin/common-mods/displayService
[2025-02-06T17:23:37.087Z] GEN /home/jenkins/workspace/Test_openjdk11_hs_sanity.system_s390x_linux_testList_2/jvmtest/system/aqa-systemtest/openjdk.test.modularity/bin/common-mods/com.helper
[2025-02-06T17:23:37.087Z] GEN /home/jenkins/workspace/Test_openjdk11_hs_sanity.system_s390x_linux_testList_2/jvmtest/system/aqa-systemtest/openjdk.test.modularity/bin/common-mods/displayServiceImpl1
[2025-02-06T17:23:37.087Z] GEN /home/jenkins/workspace/Test_openjdk11_hs_sanity.system_s390x_linux_testList_2/jvmtest/system/aqa-systemtest/openjdk.test.modularity/bin/common-mods/com.discreet
[2025-02-06T17:23:37.087Z] GEN /home/jenkins/workspace/Test_openjdk11_hs_sanity.system_s390x_linux_testList_2/jvmtest/system/aqa-systemtest/openjdk.test.modularity/bin/common-mods/com.hello
[2025-02-06T17:23:37.087Z] GEN /home/jenkins/workspace/Test_openjdk11_hs_sanity.system_s390x_linux_testList_2/jvmtest/system/aqa-systemtest/openjdk.test.modularity/bin/common-mods/com.hola
[2025-02-06T17:23:37.087Z] GEN /home/jenkins/workspace/Test_openjdk11_hs_sanity.system_s390x_linux_testList_2/jvmtest/system/aqa-systemtest/openjdk.test.modularity/bin/common-mods/displayServiceImpl2
[2025-02-06T17:23:37.087Z] GEN /home/jenkins/workspace/Test_openjdk11_hs_sanity.system_s390x_linux_testList_2/jvmtest/system/aqa-systemtest/openjdk.test.modularity/bin/common-mods/com.hi
[2025-02-06T17:23:37.087Z] GEN /home/jenkins/workspace/Test_openjdk11_hs_sanity.system_s390x_linux_testList_2/jvmtest/system/aqa-systemtest/openjdk.test.modularity/bin/common-override
[2025-02-06T17:23:37.087Z] GEN /home/jenkins/workspace/Test_openjdk11_hs_sanity.system_s390x_linux_testList_2/jvmtest/system/aqa-systemtest/openjdk.test.modularity/bin/common-override-new
[2025-02-06T17:23:37.087Z] GEN /home/jenkins/workspace/Test_openjdk11_hs_sanity.system_s390x_linux_testList_2/jvmtest/system/aqa-systemtest/openjdk.test.modularity/bin/common/displayServiceImpl3
[2025-02-06T17:23:37.087Z] GEN /home/jenkins/workspace/Test_openjdk11_hs_sanity.system_s390x_linux_testList_2/jvmtest/system/aqa-systemtest/openjdk.test.modularity/bin/common/displayServiceImpl4
[2025-02-06T17:23:37.087Z] GEN /home/jenkins/workspace/Test_openjdk11_hs_sanity.system_s390x_linux_testList_2/jvmtest/system/aqa-systemtest/openjdk.test.modularity/bin/common
[2025-02-06T17:23:37.087Z] GEN /home/jenkins/workspace/Test_openjdk11_hs_sanity.system_s390x_linux_testList_2/jvmtest/system/aqa-systemtest/openjdk.test.modularity/bin/tests
[2025-02-06T17:23:37.087Z] GEN /home/jenkins/workspace/Test_openjdk11_hs_sanity.system_s390x_linux_testList_2/jvmtest/system/aqa-systemtest/openjdk.test.modularity/bin
[2025-02-06T17:23:37.087Z] GEN /home/jenkins/workspace/Test_openjdk11_hs_sanity.system_s390x_linux_testList_2/jvmtest/system/STF/stf.core/bin
[2025-02-06T17:23:37.087Z] GEN /home/jenkins/testDependency/system_lib/log4j/log4j-api.jar
[2025-02-06T17:23:37.087Z] GEN /home/jenkins/testDependency/system_lib/log4j/log4j-core.jar
[2025-02-06T17:23:37.087Z] GEN /home/jenkins/testDependency/system_lib/junit/junit.jar
[2025-02-06T17:23:37.087Z] GEN 17:23:36.621 - Using Mode NoOptions. Values = ''
[2025-02-06T17:23:37.666Z] GEN 17:23:37.108 -
[2025-02-06T17:23:37.666Z] GEN 17:23:37.108 - Test command summary:
[2025-02-06T17:23:37.666Z] GEN 17:23:37.109 - Step Stage Command Description
[2025-02-06T17:23:37.666Z] GEN 17:23:37.109 - -----+--------+-----------------+------------
[2025-02-06T17:23:37.666Z] GEN 17:23:37.110 - 1 execute jar Create com.hello jar
[2025-02-06T17:23:37.666Z] GEN 17:23:37.110 - 2 execute jar Create com.discreet jar
[2025-02-06T17:23:37.666Z] GEN 17:23:37.130 - 3 execute jar create java.xml.jar
[2025-02-06T17:23:37.666Z] GEN 17:23:37.131 - 4 execute Run java (Negative test) Include a new package that is not exported and ensure the public type cannot be accessed
[2025-02-06T17:23:37.666Z] GEN 17:23:37.131 - 5 execute count Check output
[2025-02-06T17:23:37.666Z] GEN 17:23:37.132 - 6 execute Run java Include a new package that is not exported and check if the public type can be accessed by adding --add-exports
[2025-02-06T17:23:37.666Z] STF 17:23:37.340 -
[2025-02-06T17:23:37.666Z] STF 17:23:37.341 - Script generation completed
[2025-02-06T17:23:37.666Z] STF 17:23:37.341 -
[2025-02-06T17:23:37.666Z] STF 17:23:37.341 -
[2025-02-06T17:23:37.666Z] STF 17:23:37.341 - ======================= S E T U P =======================
[2025-02-06T17:23:37.666Z] STF 17:23:37.341 - Running setup: perl /home/jenkins/workspace/Test_openjdk11_hs_sanity.system_s390x_linux_testList_2/aqa-tests/TKG/../TKG/output_1738861907471/PatMod_Unex_1/20250206-172330-PatModTest/setUp.pl
[2025-02-06T17:23:38.331Z] STF 17:23:37.617 - SETUP stage completed
[2025-02-06T17:23:38.331Z] STF 17:23:37.626 -
[2025-02-06T17:23:38.331Z] STF 17:23:37.626 - ==================== E X E C U T E - ====================
[2025-02-06T17:23:38.331Z] STF 17:23:37.626 - Running execute: perl /home/jenkins/workspace/Test_openjdk11_hs_sanity.system_s390x_linux_testList_2/aqa-tests/TKG/../TKG/output_1738861907471/PatMod_Unex_1/20250206-172330-PatModTest/execute.pl
[2025-02-06T17:23:38.331Z] STF 17:23:37.760 -
[2025-02-06T17:23:38.331Z] STF 17:23:37.760 - Java version
[2025-02-06T17:23:38.331Z] STF 17:23:37.760 - Running: /home/jenkins/workspace/Test_openjdk11_hs_sanity.system_s390x_linux_testList_2/jdkbinary/j2sdk-image/bin/java -version
[2025-02-06T17:23:38.331Z] openjdk version "11.0.27-beta" 2025-04-15
[2025-02-06T17:23:38.331Z] OpenJDK Runtime Environment Temurin-11.0.27+1-202502060113 (build 11.0.27-beta+1-ea)
[2025-02-06T17:23:38.331Z] OpenJDK 64-Bit Server VM Temurin-11.0.27+1-202502060113 (build 11.0.27-beta+1-ea, mixed mode)
[2025-02-06T17:23:38.331Z] STF 17:23:38.136 -
[2025-02-06T17:23:38.331Z] STF 17:23:38.137 - +------ Step 1 - Create com.hello jar
[2025-02-06T17:23:38.331Z] STF 17:23:38.137 - | Create modular jar
[2025-02-06T17:23:38.331Z] STF 17:23:38.137 - | ModuleSpec: openjdk.test.modularity/bin/common-override/com.hello
[2025-02-06T17:23:38.331Z] STF 17:23:38.137 - | ModuleVersion: null
[2025-02-06T17:23:38.331Z] STF 17:23:38.137 - | MainClass: null
[2025-02-06T17:23:38.331Z] STF 17:23:38.137 - | HashModules: null
[2025-02-06T17:23:38.331Z] STF 17:23:38.137 - |
[2025-02-06T17:23:38.331Z] STF 17:23:38.137 - Running command: /home/jenkins/workspace/Test_openjdk11_hs_sanity.system_s390x_linux_testList_2/jdkbinary/j2sdk-image/bin/jar --create --file /home/jenkins/workspace/Test_openjdk11_hs_sanity.system_s390x_linux_testList_2/aqa-tests/TKG/output_1738861907471/PatMod_Unex_1/20250206-172330-PatModTest/modules/1.com.hello.jar -C /home/jenkins/workspace/Test_openjdk11_hs_sanity.system_s390x_linux_testList_2/jvmtest/system/aqa-systemtest/openjdk.test.modularity/bin/common-override/com.hello .
[2025-02-06T17:23:38.331Z] STF 17:23:38.137 - Redirecting stderr to /home/jenkins/workspace/Test_openjdk11_hs_sanity.system_s390x_linux_testList_2/aqa-tests/TKG/output_1738861907471/PatMod_Unex_1/20250206-172330-PatModTest/results/1.CMJ.stderr
[2025-02-06T17:23:38.331Z] STF 17:23:38.137 - Redirecting stdout to /home/jenkins/workspace/Test_openjdk11_hs_sanity.system_s390x_linux_testList_2/aqa-tests/TKG/output_1738861907471/PatMod_Unex_1/20250206-172330-PatModTest/results/1.CMJ.stdout
[2025-02-06T17:23:38.907Z] STF 17:23:38.262 - Monitoring processes: CMJ
[2025-02-06T17:23:40.126Z] STF 17:23:39.946 - Monitoring Report Summary:
[2025-02-06T17:23:40.126Z] STF 17:23:39.946 - o Process CMJ ended with the expected exit code (0)
[2025-02-06T17:23:40.126Z] STF 17:23:39.946 - Created modular jar: 1.com.hello.jar
[2025-02-06T17:23:40.126Z] STF 17:23:39.946 -
[2025-02-06T17:23:40.126Z] STF 17:23:39.946 - +------ Step 2 - Create com.discreet jar
[2025-02-06T17:23:40.126Z] STF 17:23:39.946 - | Create modular jar
[2025-02-06T17:23:40.126Z] STF 17:23:39.946 - | ModuleSpec: openjdk.test.modularity/bin/common-override/com.discreet
[2025-02-06T17:23:40.126Z] STF 17:23:39.946 - | ModuleVersion: null
[2025-02-06T17:23:40.126Z] STF 17:23:39.946 - | MainClass: null
[2025-02-06T17:23:40.126Z] STF 17:23:39.946 - | HashModules: null
[2025-02-06T17:23:40.126Z] STF 17:23:39.946 - |
[2025-02-06T17:23:40.126Z] STF 17:23:39.947 - Running command: /home/jenkins/workspace/Test_openjdk11_hs_sanity.system_s390x_linux_testList_2/jdkbinary/j2sdk-image/bin/jar --create --file /home/jenkins/workspace/Test_openjdk11_hs_sanity.system_s390x_linux_testList_2/aqa-tests/TKG/output_1738861907471/PatMod_Unex_1/20250206-172330-PatModTest/modules/2.com.discreet.jar -C /home/jenkins/workspace/Test_openjdk11_hs_sanity.system_s390x_linux_testList_2/jvmtest/system/aqa-systemtest/openjdk.test.modularity/bin/common-override/com.discreet .
[2025-02-06T17:23:40.126Z] STF 17:23:39.947 - Redirecting stderr to /home/jenkins/workspace/Test_openjdk11_hs_sanity.system_s390x_linux_testList_2/aqa-tests/TKG/output_1738861907471/PatMod_Unex_1/20250206-172330-PatModTest/results/2.CMJ.stderr
[2025-02-06T17:23:40.126Z] STF 17:23:39.947 - Redirecting stdout to /home/jenkins/workspace/Test_openjdk11_hs_sanity.system_s390x_linux_testList_2/aqa-tests/TKG/output_1738861907471/PatMod_Unex_1/20250206-172330-PatModTest/results/2.CMJ.stdout
[2025-02-06T17:23:40.126Z] STF 17:23:39.949 - Monitoring processes: CMJ
[2025-02-06T17:23:41.309Z] STF 17:23:41.030 - Monitoring Report Summary:
[2025-02-06T17:23:41.309Z] STF 17:23:41.030 - o Process CMJ ended with the expected exit code (0)
[2025-02-06T17:23:41.309Z] STF 17:23:41.031 - Created modular jar: 2.com.discreet.jar
[2025-02-06T17:23:41.309Z] STF 17:23:41.031 -
[2025-02-06T17:23:41.309Z] STF 17:23:41.031 - +------ Step 3 - create java.xml.jar
[2025-02-06T17:23:41.309Z] STF 17:23:41.031 - | Create modular jar
[2025-02-06T17:23:41.309Z] STF 17:23:41.031 - | ModuleSpec: openjdk.test.modularity/bin/common-override/java.xml
[2025-02-06T17:23:41.309Z] STF 17:23:41.031 - | ModuleVersion: null
[2025-02-06T17:23:41.309Z] STF 17:23:41.031 - | MainClass: null
[2025-02-06T17:23:41.309Z] STF 17:23:41.031 - | HashModules: null
[2025-02-06T17:23:41.309Z] STF 17:23:41.031 - |
[2025-02-06T17:23:41.309Z] STF 17:23:41.031 - Running command: /home/jenkins/workspace/Test_openjdk11_hs_sanity.system_s390x_linux_testList_2/jdkbinary/j2sdk-image/bin/jar --create --file /home/jenkins/workspace/Test_openjdk11_hs_sanity.system_s390x_linux_testList_2/aqa-tests/TKG/output_1738861907471/PatMod_Unex_1/20250206-172330-PatModTest/modules/3.java.xml.jar -C /home/jenkins/workspace/Test_openjdk11_hs_sanity.system_s390x_linux_testList_2/jvmtest/system/aqa-systemtest/openjdk.test.modularity/bin/common-override/java.xml .
[2025-02-06T17:23:41.309Z] STF 17:23:41.031 - Redirecting stderr to /home/jenkins/workspace/Test_openjdk11_hs_sanity.system_s390x_linux_testList_2/aqa-tests/TKG/output_1738861907471/PatMod_Unex_1/20250206-172330-PatModTest/results/3.CMJ.stderr
[2025-02-06T17:23:41.309Z] STF 17:23:41.031 - Redirecting stdout to /home/jenkins/workspace/Test_openjdk11_hs_sanity.system_s390x_linux_testList_2/aqa-tests/TKG/output_1738861907471/PatMod_Unex_1/20250206-172330-PatModTest/results/3.CMJ.stdout
[2025-02-06T17:23:41.309Z] STF 17:23:41.033 - Monitoring processes: CMJ
[2025-02-06T17:23:42.621Z] STF 17:23:42.348 - Monitoring Report Summary:
[2025-02-06T17:23:42.621Z] STF 17:23:42.348 - o Process CMJ ended with the expected exit code (0)
[2025-02-06T17:23:42.621Z] STF 17:23:42.348 - Created modular jar: 3.java.xml.jar
[2025-02-06T17:23:42.621Z] STF 17:23:42.348 -
[2025-02-06T17:23:42.621Z] STF 17:23:42.348 - +------ Step 4 - (Negative test) Include a new package that is not exported and ensure the public type cannot be accessed
[2025-02-06T17:23:42.621Z] STF 17:23:42.348 - | Run foreground process
[2025-02-06T17:23:42.621Z] STF 17:23:42.348 - | Program: /home/jenkins/workspace/Test_openjdk11_hs_sanity.system_s390x_linux_testList_2/jdkbinary/j2sdk-image/bin/java
[2025-02-06T17:23:42.621Z] STF 17:23:42.348 - | Mnemonic: OT3
[2025-02-06T17:23:42.621Z] STF 17:23:42.348 - | Echo: ECHO_ON
[2025-02-06T17:23:42.621Z] STF 17:23:42.348 - | Expectation: NON_ZERO_EXIT [1] within 1m
[2025-02-06T17:23:42.621Z] STF 17:23:42.348 - |
[2025-02-06T17:23:42.621Z] STF 17:23:42.349 - Running command: /home/jenkins/workspace/Test_openjdk11_hs_sanity.system_s390x_linux_testList_2/jdkbinary/j2sdk-image/bin/java --add-reads com.test=ALL-UNNAMED --module-path /home/jenkins/workspace/Test_openjdk11_hs_sanity.system_s390x_linux_testList_2/jvmtest/system/aqa-systemtest/openjdk.test.modularity/bin/common-mods:/home/jenkins/workspace/Test_openjdk11_hs_sanity.system_s390x_linux_testList_2/jvmtest/system/aqa-systemtest/openjdk.test.modularity/bin/tests --add-modules=com.test --patch-module com.hello=/home/jenkins/workspace/Test_openjdk11_hs_sanity.system_s390x_linux_testList_2/aqa-tests/TKG/output_1738861907471/PatMod_Unex_1/20250206-172330-PatModTest/modules/1.com.hello.jar -XX:-UseCompressedOops -classpath /home/jenkins/testDependency/system_lib/junit/junit.jar:/home/jenkins/testDependency/system_lib/junit/hamcrest-core.jar org.junit.runner.JUnitCore net.adoptopenjdk.test.modularity.junit.TestOverrideUsingAppModuleAndNewPackage
[2025-02-06T17:23:42.621Z] STF 17:23:42.349 - Redirecting stderr to /home/jenkins/workspace/Test_openjdk11_hs_sanity.system_s390x_linux_testList_2/aqa-tests/TKG/output_1738861907471/PatMod_Unex_1/20250206-172330-PatModTest/results/4.OT3.stderr
[2025-02-06T17:23:42.621Z] STF 17:23:42.349 - Redirecting stdout to /home/jenkins/workspace/Test_openjdk11_hs_sanity.system_s390x_linux_testList_2/aqa-tests/TKG/output_1738861907471/PatMod_Unex_1/20250206-172330-PatModTest/results/4.OT3.stdout
[2025-02-06T17:23:42.621Z] STF 17:23:42.356 - Monitoring processes: OT3
[2025-02-06T17:23:43.207Z] OT3 stderr WARNING: module-info.class ignored in patch: /home/jenkins/workspace/Test_openjdk11_hs_sanity.system_s390x_linux_testList_2/aqa-tests/TKG/output_1738861907471/PatMod_Unex_1/20250206-172330-PatModTest/modules/1.com.hello.jar
[2025-02-06T17:23:43.768Z] OT3 JUnit version 4.12
[2025-02-06T17:23:43.768Z] OT3 .E
[2025-02-06T17:23:44.438Z] OT3 Time: 0.013
[2025-02-06T17:23:44.438Z] OT3 There was 1 failure:
[2025-02-06T17:23:44.438Z] OT3 1) testOverrideUsingAppModuleAndNewPackage(net.adoptopenjdk.test.modularity.junit.TestOverrideUsingAppModuleAndNewPackage)
[2025-02-06T17:23:44.438Z] OT3 java.lang.IllegalAccessException: class net.adoptopenjdk.test.modularity.junit.TestOverrideUsingAppModuleAndNewPackage (in module com.test) cannot access class adoptopenjdk.test.modularity.hellonew.HelloNew (in module com.hello) because module com.hello does not export adoptopenjdk.test.modularity.hellonew to module com.test
[2025-02-06T17:23:44.438Z] OT3 at java.base/jdk.internal.reflect.Reflection.newIllegalAccessException(Reflection.java:361)
[2025-02-06T17:23:44.438Z] OT3 at java.base/java.lang.reflect.AccessibleObject.checkAccess(AccessibleObject.java:591)
[2025-02-06T17:23:44.438Z] OT3 at java.base/java.lang.reflect.Constructor.newInstance(Constructor.java:481)
[2025-02-06T17:23:44.438Z] OT3 at com.test/net.adoptopenjdk.test.modularity.junit.TestOverrideUsingAppModuleAndNewPackage.testOverrideUsingAppModuleAndNewPackage(TestOverrideUsingAppModuleAndNewPackage.java:31)
[2025-02-06T17:23:44.438Z] OT3 at java.base/jdk.internal.reflect.NativeMethodAccessorImpl.invoke0(Native Method)
[2025-02-06T17:23:44.438Z] OT3 at java.base/jdk.internal.reflect.NativeMethodAccessorImpl.invoke(NativeMethodAccessorImpl.java:62)
[2025-02-06T17:23:44.438Z] OT3 at java.base/jdk.internal.reflect.DelegatingMethodAccessorImpl.invoke(DelegatingMethodAccessorImpl.java:43)
[2025-02-06T17:23:44.438Z] OT3 at java.base/java.lang.reflect.Method.invoke(Method.java:566)
[2025-02-06T17:23:44.438Z] OT3 at org.junit.runners.model.FrameworkMethod$1.runReflectiveCall(FrameworkMethod.java:50)
[2025-02-06T17:23:44.438Z] OT3 at org.junit.internal.runners.model.ReflectiveCallable.run(ReflectiveCallable.java:12)
[2025-02-06T17:23:44.438Z] OT3 at org.junit.runners.model.FrameworkMethod.invokeExplosively(FrameworkMethod.java:47)
[2025-02-06T17:23:44.438Z] OT3 at org.junit.internal.runners.statements.InvokeMethod.evaluate(InvokeMethod.java:17)
[2025-02-06T17:23:44.438Z] OT3 at org.junit.runners.ParentRunner.runLeaf(ParentRunner.java:325)
[2025-02-06T17:23:44.438Z] OT3 at org.junit.runners.BlockJUnit4ClassRunner.runChild(BlockJUnit4ClassRunner.java:78)
[2025-02-06T17:23:44.438Z] OT3 at org.junit.runners.BlockJUnit4ClassRunner.runChild(BlockJUnit4ClassRunner.java:57)
[2025-02-06T17:23:44.438Z] OT3 at org.junit.runners.ParentRunner$3.run(ParentRunner.java:290)
[2025-02-06T17:23:44.438Z] OT3 at org.junit.runners.ParentRunner$1.schedule(ParentRunner.java:71)
[2025-02-06T17:23:44.438Z] OT3 at org.junit.runners.ParentRunner.runChildren(ParentRunner.java:288)
[2025-02-06T17:23:44.438Z] OT3 at org.junit.runners.ParentRunner.access$000(ParentRunner.java:58)
[2025-02-06T17:23:44.438Z] OT3 at org.junit.runners.ParentRunner$2.evaluate(ParentRunner.java:268)
[2025-02-06T17:23:44.438Z] OT3 at org.junit.runners.ParentRunner.run(ParentRunner.java:363)
[2025-02-06T17:23:44.438Z] OT3 at org.junit.runners.Suite.runChild(Suite.java:128)
[2025-02-06T17:23:44.438Z] OT3 at org.junit.runners.Suite.runChild(Suite.java:27)
[2025-02-06T17:23:44.438Z] OT3 at org.junit.runners.ParentRunner$3.run(ParentRunner.java:290)
[2025-02-06T17:23:44.438Z] OT3 at org.junit.runners.ParentRunner$1.schedule(ParentRunner.java:71)
[2025-02-06T17:23:44.438Z] OT3 at org.junit.runners.ParentRunner.runChildren(ParentRunner.java:288)
[2025-02-06T17:23:44.438Z] OT3 at org.junit.runners.ParentRunner.access$000(ParentRunner.java:58)
[2025-02-06T17:23:44.438Z] OT3 at org.junit.runners.ParentRunner$2.evaluate(ParentRunner.java:268)
[2025-02-06T17:23:44.438Z] OT3 at org.junit.runners.ParentRunner.run(ParentRunner.java:363)
[2025-02-06T17:23:44.438Z] OT3 at org.junit.runner.JUnitCore.run(JUnitCore.java:137)
[2025-02-06T17:23:44.438Z] OT3 at org.junit.runner.JUnitCore.run(JUnitCore.java:115)
[2025-02-06T17:23:44.438Z] OT3 at org.junit.runner.JUnitCore.runMain(JUnitCore.java:77)
[2025-02-06T17:23:44.438Z] OT3 at org.junit.runner.JUnitCore.main(JUnitCore.java:36)
[2025-02-06T17:23:44.438Z] OT3
[2025-02-06T17:23:44.438Z] OT3 FAILURES!!!
[2025-02-06T17:23:44.438Z] OT3 Tests run: 1, Failures: 1
[2025-02-06T17:23:44.439Z] OT3
[2025-02-06T17:23:44.439Z] STF 17:23:43.776 - Monitoring Report Summary:
[2025-02-06T17:23:44.439Z] STF 17:23:43.776 - o Process OT3 ended with the expected exit code (1)
[2025-02-06T17:23:44.439Z] STF 17:23:43.776 -
[2025-02-06T17:23:44.439Z] STF 17:23:43.776 - +------ Step 5 - Check output
[2025-02-06T17:23:44.439Z] STF 17:23:43.776 - | Count file matches
[2025-02-06T17:23:44.439Z] STF 17:23:43.777 - | TargetFile: /home/jenkins/workspace/Test_openjdk11_hs_sanity.system_s390x_linux_testList_2/aqa-tests/TKG/output_1738861907471/PatMod_Unex_1/20250206-172330-PatModTest/results/4.OT3.stdout
[2025-02-06T17:23:44.439Z] STF 17:23:43.777 - | ExpectedNumMatches: 1
[2025-02-06T17:23:44.439Z] STF 17:23:43.777 - | SearchStrings: ["java.lang.IllegalAccessException"]
[2025-02-06T17:23:44.439Z] STF 17:23:43.777 - |
[2025-02-06T17:23:44.439Z] STF 17:23:43.777 - Found 1 instances of ["java.lang.IllegalAccessException"]
[2025-02-06T17:23:44.439Z] STF 17:23:43.777 -
[2025-02-06T17:23:44.439Z] STF 17:23:43.777 - +------ Step 6 - Include a new package that is not exported and check if the public type can be accessed by adding --add-exports
[2025-02-06T17:23:44.439Z] STF 17:23:43.777 - | Run foreground process
[2025-02-06T17:23:44.439Z] STF 17:23:43.777 - | Program: /home/jenkins/workspace/Test_openjdk11_hs_sanity.system_s390x_linux_testList_2/jdkbinary/j2sdk-image/bin/java
[2025-02-06T17:23:44.439Z] STF 17:23:43.777 - | Mnemonic: OT4
[2025-02-06T17:23:44.439Z] STF 17:23:43.777 - | Echo: ECHO_ON
[2025-02-06T17:23:44.439Z] STF 17:23:43.777 - | Expectation: CLEAN_RUN within 1m
[2025-02-06T17:23:44.439Z] STF 17:23:43.777 - |
[2025-02-06T17:23:44.439Z] STF 17:23:43.777 - Running command: /home/jenkins/workspace/Test_openjdk11_hs_sanity.system_s390x_linux_testList_2/jdkbinary/j2sdk-image/bin/java --add-reads com.test=ALL-UNNAMED --module-path /home/jenkins/workspace/Test_openjdk11_hs_sanity.system_s390x_linux_testList_2/jvmtest/system/aqa-systemtest/openjdk.test.modularity/bin/common-mods:/home/jenkins/workspace/Test_openjdk11_hs_sanity.system_s390x_linux_testList_2/jvmtest/system/aqa-systemtest/openjdk.test.modularity/bin/tests --add-modules=com.test --add-exports com.hello/adoptopenjdk.test.modularity.hellonew=com.test --patch-module com.hello=/home/jenkins/workspace/Test_openjdk11_hs_sanity.system_s390x_linux_testList_2/aqa-tests/TKG/output_1738861907471/PatMod_Unex_1/20250206-172330-PatModTest/modules/1.com.hello.jar -XX:-UseCompressedOops -classpath /home/jenkins/testDependency/system_lib/junit/junit.jar:/home/jenkins/testDependency/system_lib/junit/hamcrest-core.jar org.junit.runner.JUnitCore net.adoptopenjdk.test.modularity.junit.TestOverrideUsingAppModuleAndNewPackage
[2025-02-06T17:23:44.439Z] STF 17:23:43.777 - Redirecting stderr to /home/jenkins/workspace/Test_openjdk11_hs_sanity.system_s390x_linux_testList_2/aqa-tests/TKG/output_1738861907471/PatMod_Unex_1/20250206-172330-PatModTest/results/6.OT4.stderr
[2025-02-06T17:23:44.439Z] STF 17:23:43.777 - Redirecting stdout to /home/jenkins/workspace/Test_openjdk11_hs_sanity.system_s390x_linux_testList_2/aqa-tests/TKG/output_1738861907471/PatMod_Unex_1/20250206-172330-PatModTest/results/6.OT4.stdout
[2025-02-06T17:23:44.439Z] STF 17:23:43.780 - Monitoring processes: OT4
[2025-02-06T17:23:45.123Z] OT4 stderr WARNING: module-info.class ignored in patch: /home/jenkins/workspace/Test_openjdk11_hs_sanity.system_s390x_linux_testList_2/aqa-tests/TKG/output_1738861907471/PatMod_Unex_1/20250206-172330-PatModTest/modules/1.com.hello.jar
[2025-02-06T17:23:45.779Z] OT4 JUnit version 4.12
[2025-02-06T17:23:46.336Z] OT4 .
[2025-02-06T17:23:46.336Z] OT4 Time: 0.015
[2025-02-06T17:23:46.336Z] OT4
[2025-02-06T17:23:46.336Z] OT4 OK (1 test)
[2025-02-06T17:23:46.336Z] OT4
[2025-02-06T17:23:46.945Z] STF 17:23:46.371 - Monitoring Report Summary:
[2025-02-06T17:23:46.945Z] STF 17:23:46.372 - o Process OT4 ended with the expected exit code (0)
[2025-02-06T17:23:46.945Z] STF 17:23:46.372 - EXECUTE stage completed
[2025-02-06T17:23:46.945Z] STF 17:23:46.413 -
[2025-02-06T17:23:46.945Z] STF 17:23:46.413 - ==================== T E A R D O W N ====================
[2025-02-06T17:23:46.945Z] STF 17:23:46.413 - Running teardown: perl /home/jenkins/workspace/Test_openjdk11_hs_sanity.system_s390x_linux_testList_2/aqa-tests/TKG/../TKG/output_1738861907471/PatMod_Unex_1/20250206-172330-PatModTest/tearDown.pl
[2025-02-06T17:23:46.945Z] STF 17:23:46.486 - TEARDOWN stage completed
[2025-02-06T17:23:46.945Z] STF 17:23:46.515 -
[2025-02-06T17:23:46.945Z] STF 17:23:46.515 - ===================== R E S U L T S =====================
[2025-02-06T17:23:46.945Z] STF 17:23:46.515 - Stage results:
[2025-02-06T17:23:46.945Z] STF 17:23:46.515 - setUp: pass
[2025-02-06T17:23:46.945Z] STF 17:23:46.515 - execute: pass
[2025-02-06T17:23:46.945Z] STF 17:23:46.515 - teardown: pass
[2025-02-06T17:23:46.945Z] STF 17:23:46.515 -
[2025-02-06T17:23:46.945Z] STF 17:23:46.515 - Overall result: PASSED
[2025-02-06T17:23:46.945Z] -----------------------------------
[2025-02-06T17:23:46.945Z] PatMod_Unex_1_PASSED
[2025-02-06T17:23:46.945Z] -----------------------------------
[2025-02-06T17:23:46.945Z]
[2025-02-06T17:23:46.945Z] TEST TEARDOWN:
[2025-02-06T17:23:46.945Z] Nothing to be done for teardown.
[2025-02-06T17:23:46.945Z] PatMod_Unex_1 Finish Time: Thu Feb 6 17:23:46 2025 Epoch Time (ms): 1738862626546