Post Test
[2025-05-29T12:57:47.967Z] make[4]: Leaving directory '/home/jenkins/workspace/Test_openjdk17_hs_extended.openjdk_s390x_linux_testList_4/aqa-tests/openjdk'
[2025-05-29T12:57:47.967Z] make[3]: Leaving directory '/home/jenkins/workspace/Test_openjdk17_hs_extended.openjdk_s390x_linux_testList_4/aqa-tests'
[2025-05-29T12:57:47.967Z]
[2025-05-29T12:57:47.967Z]
[2025-05-29T12:57:47.967Z] All tests finished, run result summary:
[2025-05-29T12:57:47.967Z] cd "/home/jenkins/workspace/Test_openjdk17_hs_extended.openjdk_s390x_linux_testList_4/aqa-tests/TKG/../TKG/scripts"; \
[2025-05-29T12:57:47.967Z] perl "resultsSum.pl" --failuremk="/home/jenkins/workspace/Test_openjdk17_hs_extended.openjdk_s390x_linux_testList_4/aqa-tests/TKG/../TKG/failedtargets.mk" --resultFile="/home/jenkins/workspace/Test_openjdk17_hs_extended.openjdk_s390x_linux_testList_4/aqa-tests/TKG/../TKG/output_17485048301053/TestTargetResult" --platFile="/home/jenkins/workspace/Test_openjdk17_hs_extended.openjdk_s390x_linux_testList_4/aqa-tests/TKG/../TKG/resources/buildPlatformMap.properties" --diagnostic=failure --jdkVersion=17 --jdkImpl=hotspot --jdkVendor="eclipse" --spec=linux_390-64 --buildList=openjdk --customTarget="" --testTarget=testList --tapPath=/home/jenkins/workspace/Test_openjdk17_hs_extended.openjdk_s390x_linux_testList_4/aqa-tests/TKG/../TKG/output_17485048301053/ --tapName=Test_openjdk17_hs_extended.openjdk_s390x_linux_testList_4.tap --comment=""
[2025-05-29T12:57:47.967Z]
[2025-05-29T12:57:47.967Z]
[2025-05-29T12:57:47.967Z] TEST TARGETS SUMMARY
[2025-05-29T12:57:47.967Z] ++++++++++++++++++++++++++++++++++++++++++++++++++++++++++++++++++++++++++
[2025-05-29T12:57:47.967Z] PASSED test targets:
[2025-05-29T12:57:47.967Z] jdk_jfr_0 - Test results: passed: 527
[2025-05-29T12:57:47.967Z] jdk_jfr_1 - Test results: passed: 527
[2025-05-29T12:57:47.967Z] jdk_imageio_0 - Test results: passed: 202
[2025-05-29T12:57:47.967Z] jdk_vector_0 - Test results: passed: 74
[2025-05-29T12:57:47.967Z] jdk_vector_1 - Test results: passed: 74
[2025-05-29T12:57:47.967Z]
[2025-05-29T12:57:47.967Z] FAILED test targets:
[2025-05-29T12:57:47.967Z] jdk_net_0 - Test results: passed: 800; failed: 1; error: 2
[2025-05-29T12:57:47.967Z] Failed test cases:
[2025-05-29T12:57:47.967Z] TEST: java/net/DatagramSocket/DatagramSocketExample.java
[2025-05-29T12:57:47.967Z] TEST: java/net/DatagramSocket/DatagramSocketMulticasting.java
[2025-05-29T12:57:47.967Z] TEST: java/net/MulticastSocket/SetLoopbackModeIPv4.java
[2025-05-29T12:57:47.967Z]
[2025-05-29T12:57:47.967Z] jdk_management_1 - Test results: passed: 128; failed: 3
[2025-05-29T12:57:47.967Z] Failed test cases:
[2025-05-29T12:57:47.967Z] TEST: sun/management/jdp/JdpDefaultsTest.java
[2025-05-29T12:57:47.967Z] TEST: sun/management/jdp/JdpJmxRemoteDynamicPortTest.java
[2025-05-29T12:57:47.967Z] TEST: sun/management/jdp/JdpSpecificAddressTest.java
[2025-05-29T12:57:47.967Z]
[2025-05-29T12:57:47.967Z]
[2025-05-29T12:57:47.967Z] TOTAL: 7 EXECUTED: 7 PASSED: 5 FAILED: 2 DISABLED: 0 SKIPPED: 0
[2025-05-29T12:57:47.967Z] ++++++++++++++++++++++++++++++++++++++++++++++++++++++++++++++++++++++++++
[2025-05-29T12:57:47.967Z]
[2025-05-29T12:57:47.967Z] TESTCASES RESULTS SUMMARY: passed: 2,332; failed: 4; error: 2; skipped: 0
[2025-05-29T12:57:47.967Z] ++++++++++++++++++++++++++++++++++++++++++++++++++++++++++++++++++++++++++
[2025-05-29T12:57:47.967Z] make[2]: *** [settings.mk:454: resultsSummary] Error 2
[2025-05-29T12:57:47.967Z] make[2]: Leaving directory '/home/jenkins/workspace/Test_openjdk17_hs_extended.openjdk_s390x_linux_testList_4/aqa-tests/TKG'
[2025-05-29T12:57:47.967Z] make[1]: *** [makefile:62: _testList] Error 2
[2025-05-29T12:57:47.967Z] make[1]: Leaving directory '/home/jenkins/workspace/Test_openjdk17_hs_extended.openjdk_s390x_linux_testList_4/aqa-tests/TKG'
[2025-05-29T12:57:47.967Z] make: *** [parallelList.mk:20: testList_4] Error 2
[Pipeline] sh
[2025-05-29T12:57:50.148Z] + uname
[2025-05-29T12:57:50.148Z] + [ Linux = AIX ]
[2025-05-29T12:57:50.148Z] + uname
[2025-05-29T12:57:50.148Z] + [ Linux = SunOS ]
[2025-05-29T12:57:50.148Z] + uname
[2025-05-29T12:57:50.148Z] + [ Linux = *BSD ]
[2025-05-29T12:57:50.148Z] + MAKE=make
[2025-05-29T12:57:50.148Z] + make -f ./aqa-tests/TKG/testEnv.mk testEnvTeardown
[2025-05-29T12:57:50.148Z] make: Nothing to be done for 'testEnvTeardown'.
[Pipeline] }
[2025-05-29T12:57:50.441Z] Xvfb stopping
[Pipeline] // wrap
[Pipeline] echo
[2025-05-29T12:57:51.159Z] There were test failures, set build result to UNSTABLE.
[Pipeline] }
[Pipeline] // stage
[Pipeline] stage
[Pipeline] { (Post)
[Pipeline] step
[2025-05-29T12:57:51.345Z] TAP Reports Processing: START
[2025-05-29T12:57:51.345Z] Looking for TAP results report in workspace using pattern: aqa-tests/TKG/**/*.tap
[2025-05-29T12:57:57.873Z] Saving reports...
[2025-05-29T12:57:57.985Z] Processing '/home/jenkins/.jenkins/jobs/Test_openjdk17_hs_extended.openjdk_s390x_linux_testList_4/builds/35/tap-master-files/aqa-tests/TKG/output_17485048301053/Test_openjdk17_hs_extended.openjdk_s390x_linux_testList_4.tap'
[2025-05-29T12:57:57.985Z] Parsing TAP test result [/home/jenkins/.jenkins/jobs/Test_openjdk17_hs_extended.openjdk_s390x_linux_testList_4/builds/35/tap-master-files/aqa-tests/TKG/output_17485048301053/Test_openjdk17_hs_extended.openjdk_s390x_linux_testList_4.tap].
[2025-05-29T12:57:57.987Z] There are failed test cases. Marking build as UNSTABLE
[2025-05-29T12:57:57.987Z] TAP Reports Processing: FINISH
[Pipeline] echo
[2025-05-29T12:57:57.996Z] Saving aqa-tests/testenv/testenv.properties file on jenkins.
[Pipeline] archiveArtifacts
[2025-05-29T12:57:58.101Z] Archiving artifacts
[2025-05-29T12:57:58.322Z] Recording fingerprints
[Pipeline] echo
[2025-05-29T12:57:58.445Z] Saving aqa-tests/TKG/**/*.tap file on jenkins.
[Pipeline] archiveArtifacts
[2025-05-29T12:57:58.547Z] Archiving artifacts
[2025-05-29T12:57:59.688Z] Recording fingerprints
[Pipeline] sh
[2025-05-29T12:58:01.944Z] + tar -cf - ./aqa-tests/TKG/output_17485048301053
[2025-05-29T12:58:01.944Z] + pigz -9
[Pipeline] echo
[2025-05-29T12:58:48.416Z] ARTIFACTORY_SERVER is not set. Saving artifacts on jenkins.
[Pipeline] archiveArtifacts
[2025-05-29T12:58:48.525Z] Archiving artifacts
[2025-05-29T12:58:55.234Z] Recording fingerprints
[Pipeline] findFiles
[Pipeline] echo
[2025-05-29T12:58:58.502Z] Tap file found: aqa-tests/TKG/output_17485048301053/Test_openjdk17_hs_extended.openjdk_s390x_linux_testList_4.tap...
[Pipeline] readFile
[Pipeline] echo
[2025-05-29T12:58:58.659Z] Rerun in Grinder with failed test targets: https://ci.adoptium.net/job/Grinder/parambuild/?SDK_RESOURCE=upstream&TARGET=testList+TESTLIST=jdk_net_0,jdk_management_1&BASE_DOCKER_REGISTRY_CREDENTIAL_ID=&TEST_FLAG=&UPSTREAM_TEST_JOB_NAME=Test_openjdk17_hs_extended.openjdk_s390x_linux&DOCKER_REQUIRED=false&ACTIVE_NODE_TIMEOUT=5&VENDOR_TEST_DIRS=&EXTRA_DOCKER_ARGS=&TKG_OWNER_BRANCH=adoptium%3Amaster&OPENJ9_SYSTEMTEST_OWNER_BRANCH=eclipse%3Amaster&PLATFORM=s390x_linux&GENERATE_JOBS=true&KEEP_REPORTDIR=true&PERSONAL_BUILD=false&DOCKER_REGISTRY_DIR=&RERUN_ITERATIONS=0&ADOPTOPENJDK_REPO=https%3A%2F%2Fgithub.com%2Fadoptium%2Faqa-tests.git&SETUP_JCK_RUN=false&DOCKER_REGISTRY_URL_CREDENTIAL_ID=&LABEL=&EXTRA_OPTIONS=&CUSTOMIZED_SDK_URL=&BUILD_IDENTIFIER=&JENKINS_KEY=&ADOPTOPENJDK_BRANCH=master&LIGHT_WEIGHT_CHECKOUT=false&USE_JRE=false&ARTIFACTORY_SERVER=&KEEP_WORKSPACE=false&USER_CREDENTIALS_ID=&JDK_VERSION=17&DOCKER_REGISTRY_URL=&ITERATIONS=1&VENDOR_TEST_REPOS=&JDK_REPO=https%3A%2F%2Fgithub.com%2Fadoptium%2Fjdk17u&JCK_GIT_BRANCH=master&OPENJ9_BRANCH=master&OPENJ9_SHA=&JCK_GIT_REPO=&VENDOR_TEST_BRANCHES=&UPSTREAM_JOB_NAME=build-scripts%2Fjobs%2Fjdk17u%2Fjdk17u-linux-s390x-temurin&OPENJ9_REPO=https%3A%2F%2Fgithub.com%2Feclipse-openj9%2Fopenj9.git&CLOUD_PROVIDER=&CUSTOM_TARGET=&VENDOR_TEST_SHAS=&JDK_BRANCH=jdk-17.0.16%2B5_adopt&LABEL_ADDITION=&ARTIFACTORY_REPO=&ARTIFACTORY_ROOT_DIR=&UPSTREAM_TEST_JOB_NUMBER=216&DOCKERIMAGE_TAG=&TEST_TIME=&JDK_IMPL=hotspot&SSH_AGENT_CREDENTIAL=&AUTO_DETECT=true&SLACK_CHANNEL=aqavit-bot&DYNAMIC_COMPILE=false&RELATED_NODES=&ADOPTOPENJDK_SYSTEMTEST_OWNER_BRANCH=adoptium%3Amaster&APPLICATION_OPTIONS=&CUSTOMIZED_SDK_URL_CREDENTIAL_ID=eclipse_temurin_bot_email_and_token&ARCHIVE_TEST_RESULTS=false&NUM_MACHINES=&OPENJDK_SHA=&TRSS_URL=&RERUN_FAILURE=false&USE_TESTENV_PROPERTIES=false&BUILD_LIST=openjdk&ADDITIONAL_ARTIFACTS_REQUIRED=&UPSTREAM_JOB_NUMBER=496&STF_OWNER_BRANCH=adoptium%3Amaster&TIME_LIMIT=25&JVM_OPTIONS=&PARALLEL=None
[Pipeline] echo
[2025-05-29T12:58:58.717Z] Rerun failed jdk test cases in Grinder with jdk_custom target: https://ci.adoptium.net/job/Grinder/parambuild/?SDK_RESOURCE=upstream&TARGET=jdk_custom&BASE_DOCKER_REGISTRY_CREDENTIAL_ID=&TEST_FLAG=&UPSTREAM_TEST_JOB_NAME=Test_openjdk17_hs_extended.openjdk_s390x_linux&DOCKER_REQUIRED=false&ACTIVE_NODE_TIMEOUT=5&VENDOR_TEST_DIRS=&EXTRA_DOCKER_ARGS=&TKG_OWNER_BRANCH=adoptium%3Amaster&OPENJ9_SYSTEMTEST_OWNER_BRANCH=eclipse%3Amaster&PLATFORM=s390x_linux&GENERATE_JOBS=true&KEEP_REPORTDIR=true&PERSONAL_BUILD=false&DOCKER_REGISTRY_DIR=&RERUN_ITERATIONS=0&ADOPTOPENJDK_REPO=https%3A%2F%2Fgithub.com%2Fadoptium%2Faqa-tests.git&SETUP_JCK_RUN=false&DOCKER_REGISTRY_URL_CREDENTIAL_ID=&LABEL=&EXTRA_OPTIONS=&CUSTOMIZED_SDK_URL=&BUILD_IDENTIFIER=&JENKINS_KEY=&ADOPTOPENJDK_BRANCH=master&LIGHT_WEIGHT_CHECKOUT=false&USE_JRE=false&ARTIFACTORY_SERVER=&KEEP_WORKSPACE=false&USER_CREDENTIALS_ID=&JDK_VERSION=17&DOCKER_REGISTRY_URL=&ITERATIONS=1&VENDOR_TEST_REPOS=&JDK_REPO=https%3A%2F%2Fgithub.com%2Fadoptium%2Fjdk17u&JCK_GIT_BRANCH=master&OPENJ9_BRANCH=master&OPENJ9_SHA=&JCK_GIT_REPO=&VENDOR_TEST_BRANCHES=&UPSTREAM_JOB_NAME=build-scripts%2Fjobs%2Fjdk17u%2Fjdk17u-linux-s390x-temurin&OPENJ9_REPO=https%3A%2F%2Fgithub.com%2Feclipse-openj9%2Fopenj9.git&CLOUD_PROVIDER=&CUSTOM_TARGET=java%2Fnet%2FDatagramSocket%2FDatagramSocketExample.java+java%2Fnet%2FDatagramSocket%2FDatagramSocketMulticasting.java+java%2Fnet%2FMulticastSocket%2FSetLoopbackModeIPv4.java+sun%2Fmanagement%2Fjdp%2FJdpDefaultsTest.java+sun%2Fmanagement%2Fjdp%2FJdpJmxRemoteDynamicPortTest.java+sun%2Fmanagement%2Fjdp%2FJdpSpecificAddressTest.java&VENDOR_TEST_SHAS=&JDK_BRANCH=jdk-17.0.16%2B5_adopt&LABEL_ADDITION=&ARTIFACTORY_REPO=&ARTIFACTORY_ROOT_DIR=&UPSTREAM_TEST_JOB_NUMBER=216&DOCKERIMAGE_TAG=&TEST_TIME=&JDK_IMPL=hotspot&SSH_AGENT_CREDENTIAL=&AUTO_DETECT=true&SLACK_CHANNEL=aqavit-bot&DYNAMIC_COMPILE=false&RELATED_NODES=&ADOPTOPENJDK_SYSTEMTEST_OWNER_BRANCH=adoptium%3Amaster&APPLICATION_OPTIONS=&CUSTOMIZED_SDK_URL_CREDENTIAL_ID=eclipse_temurin_bot_email_and_token&ARCHIVE_TEST_RESULTS=false&NUM_MACHINES=&OPENJDK_SHA=&TRSS_URL=&RERUN_FAILURE=false&USE_TESTENV_PROPERTIES=false&BUILD_LIST=openjdk&ADDITIONAL_ARTIFACTS_REQUIRED=&UPSTREAM_JOB_NUMBER=496&STF_OWNER_BRANCH=adoptium%3Amaster&TIME_LIMIT=25&JVM_OPTIONS=&PARALLEL=None
[Pipeline] junit
[2025-05-29T12:58:58.830Z] Recording test results
[2025-05-29T12:59:05.914Z] [Checks API] No suitable checks publisher found.
[Pipeline] }
[Pipeline] // stage
[Pipeline] echo
[2025-05-29T12:59:05.956Z] PROCESSCATCH: Terminating any hung/left over test processes:
[Pipeline] sh
[2025-05-29T12:59:07.230Z] + aqa-tests/terminateTestProcesses.sh jenkins
[2025-05-29T12:59:07.230Z] Unix type machine..
[2025-05-29T12:59:07.230Z] Running on a Linux host
[2025-05-29T12:59:07.230Z] Woohoo - no rogue processes detected!
[Pipeline] cleanWs
[2025-05-29T12:59:07.788Z] [WS-CLEANUP] Deleting project workspace...
[2025-05-29T12:59:07.788Z] [WS-CLEANUP] Deferred wipeout is disabled by the job configuration...
[2025-05-29T12:59:17.925Z] [WS-CLEANUP] done
[Pipeline] sh
[2025-05-29T12:59:19.207Z] + find /tmp -name *core* -print -exec rm -f {} ;
[2025-05-29T12:59:24.078Z] + true
[Pipeline] }
[Pipeline] // timeout
[Pipeline] timeout
[2025-05-29T12:59:24.425Z] Timeout set to expire in 5 min 0 sec
[Pipeline] {
[Pipeline] }
[Pipeline] // timeout
[Pipeline] }
[Pipeline] // node
[Pipeline] }
[Pipeline] // stage
[Pipeline] echo
[2025-05-29T12:59:24.561Z] SETUP_LABEL: ci.role.test
[Pipeline] }
[Pipeline] // timestamps
[Pipeline] End of Pipeline
Finished: UNSTABLE