jdk_net_1
[2025-06-12T06:23:06.777Z] Running test jdk_net_1 ...
[2025-06-12T06:23:06.777Z] ===============================================
[2025-06-12T06:23:06.777Z] jdk_net_1 Start Time: Thu Jun 12 06:23:05 2025 Epoch Time (ms): 1749709385691
[2025-06-12T06:23:06.777Z] variation: Mode650
[2025-06-12T06:23:06.777Z] JVM_OPTIONS: -XX:-UseCompressedOops
[2025-06-12T06:23:06.777Z] { \
[2025-06-12T06:23:06.777Z] echo ""; echo "TEST SETUP:"; \
[2025-06-12T06:23:06.777Z] echo "Nothing to be done for setup."; \
[2025-06-12T06:23:06.777Z] mkdir -p "/home/jenkins/workspace/Test_openjdk11_hs_extended.openjdk_x86-64_linux_testList_5/aqa-tests/TKG/../TKG/output_17497093859969/jdk_net_1"; \
[2025-06-12T06:23:06.777Z] cd "/home/jenkins/workspace/Test_openjdk11_hs_extended.openjdk_x86-64_linux_testList_5/aqa-tests/TKG/../TKG/output_17497093859969/jdk_net_1"; \
[2025-06-12T06:23:06.777Z] echo ""; echo "TESTING:"; \
[2025-06-12T06:23:06.777Z] "/home/jenkins/workspace/Test_openjdk11_hs_extended.openjdk_x86-64_linux_testList_5/jdkbinary/j2sdk-image/bin/java" -Xmx512m -jar "/home/jenkins/workspace/Test_openjdk11_hs_extended.openjdk_x86-64_linux_testList_5/aqa-tests/TKG/../../jvmtest/openjdk/jtreg/lib/jtreg.jar" \
[2025-06-12T06:23:06.777Z] -agentvm -a -ea -esa -v:fail,error,time,nopass -retain:fail,error,*.dmp,javacore.*,heapdump.*,*.trc -ignore:quiet -timeoutFactor:8 -xml:verify -concurrency:3 -nativepath:"/home/jenkins/workspace/Test_openjdk11_hs_extended.openjdk_x86-64_linux_testList_5/jdkbinary/openjdk-test-image/jdk/jtreg/native" -vmoptions:"-Xmx512m -XX:-UseCompressedOops " \
[2025-06-12T06:23:06.777Z] -w ""/home/jenkins/workspace/Test_openjdk11_hs_extended.openjdk_x86-64_linux_testList_5/aqa-tests/TKG/../TKG/output_17497093859969/jdk_net_1"/work" \
[2025-06-12T06:23:06.777Z] -r ""/home/jenkins/workspace/Test_openjdk11_hs_extended.openjdk_x86-64_linux_testList_5/aqa-tests/TKG/../TKG/output_17497093859969/jdk_net_1"/report" \
[2025-06-12T06:23:06.777Z] -jdk:"/home/jenkins/workspace/Test_openjdk11_hs_extended.openjdk_x86-64_linux_testList_5/jdkbinary/j2sdk-image" \
[2025-06-12T06:23:06.777Z] -exclude:"/home/jenkins/workspace/Test_openjdk11_hs_extended.openjdk_x86-64_linux_testList_5/aqa-tests/TKG/../openjdk/openjdk-jdk/test/jdk/ProblemList.txt" \
[2025-06-12T06:23:06.777Z] -exclude:"/home/jenkins/workspace/Test_openjdk11_hs_extended.openjdk_x86-64_linux_testList_5/aqa-tests/TKG/../../jvmtest/openjdk/excludes/ProblemList_openjdk11.txt" \
[2025-06-12T06:23:06.777Z] \
[2025-06-12T06:23:06.777Z] -exclude:"/home/jenkins/workspace/Test_openjdk11_hs_extended.openjdk_x86-64_linux_testList_5/aqa-tests/TKG/../openjdk/excludes/vendors/eclipse/ProblemList_openjdk11.txt" \
[2025-06-12T06:23:06.777Z] "/home/jenkins/workspace/Test_openjdk11_hs_extended.openjdk_x86-64_linux_testList_5/aqa-tests/TKG/../openjdk/openjdk-jdk/test/jdk:jdk_net"; \
[2025-06-12T06:23:06.777Z] if [ $? -eq 0 ]; then echo "-----------------------------------"; echo "jdk_net_1""_PASSED"; echo "-----------------------------------"; cd /home/jenkins/workspace/Test_openjdk11_hs_extended.openjdk_x86-64_linux_testList_5/aqa-tests/TKG/..; else echo "-----------------------------------"; echo "jdk_net_1""_FAILED"; echo "-----------------------------------"; fi; \
[2025-06-12T06:23:06.777Z] echo ""; echo "TEST TEARDOWN:"; \
[2025-06-12T06:23:06.777Z] echo "Nothing to be done for teardown."; \
[2025-06-12T06:23:06.777Z] } 2>&1 | tee -a "/home/jenkins/workspace/Test_openjdk11_hs_extended.openjdk_x86-64_linux_testList_5/aqa-tests/TKG/../TKG/output_17497093859969/TestTargetResult";
[2025-06-12T06:23:06.777Z]
[2025-06-12T06:23:06.777Z] TEST SETUP:
[2025-06-12T06:23:06.777Z] Nothing to be done for setup.
[2025-06-12T06:23:06.777Z]
[2025-06-12T06:23:06.777Z] TESTING:
[2025-06-12T06:23:07.446Z] Directory "/home/jenkins/workspace/Test_openjdk11_hs_extended.openjdk_x86-64_linux_testList_5/aqa-tests/TKG/../TKG/output_17497093859969/jdk_net_1/work" not found: creating
[2025-06-12T06:23:07.446Z] Directory "/home/jenkins/workspace/Test_openjdk11_hs_extended.openjdk_x86-64_linux_testList_5/aqa-tests/TKG/../TKG/output_17497093859969/jdk_net_1/report" not found: creating
[2025-06-12T06:23:10.467Z] XML output with verification to /home/jenkins/workspace/Test_openjdk11_hs_extended.openjdk_x86-64_linux_testList_5/aqa-tests/TKG/output_17497093859969/jdk_net_1/work
[2025-06-12T06:25:12.781Z] --------------------------------------------------
[2025-06-12T06:25:12.781Z] TEST: java/net/httpclient/http2/ConnectionReuseTest.java
[2025-06-12T06:25:12.781Z] TEST JDK: /home/jenkins/workspace/Test_openjdk11_hs_extended.openjdk_x86-64_linux_testList_5/jdkbinary/j2sdk-image
[2025-06-12T06:25:12.781Z]
[2025-06-12T06:25:12.781Z] ACTION: build -- Passed. Build successful
[2025-06-12T06:25:12.781Z] REASON: User specified action: run build jdk.test.lib.net.SimpleSSLContext HttpServerAdapters ReferenceTracker jdk.test.lib.net.IPSupport
[2025-06-12T06:25:12.781Z] TIME: 0.223 seconds
[2025-06-12T06:25:12.781Z] messages:
[2025-06-12T06:25:12.781Z] command: build jdk.test.lib.net.SimpleSSLContext HttpServerAdapters ReferenceTracker jdk.test.lib.net.IPSupport
[2025-06-12T06:25:12.781Z] reason: User specified action: run build jdk.test.lib.net.SimpleSSLContext HttpServerAdapters ReferenceTracker jdk.test.lib.net.IPSupport
[2025-06-12T06:25:12.781Z] started: Thu Jun 12 06:24:54 UTC 2025
[2025-06-12T06:25:12.781Z] Library ../:
[2025-06-12T06:25:12.781Z] compile: HttpServerAdapters, ReferenceTracker
[2025-06-12T06:25:12.781Z] Library /test/lib:
[2025-06-12T06:25:12.781Z] compile: jdk.test.lib.net.IPSupport
[2025-06-12T06:25:12.781Z] finished: Thu Jun 12 06:24:54 UTC 2025
[2025-06-12T06:25:12.781Z] elapsed time (seconds): 0.223
[2025-06-12T06:25:12.781Z]
[2025-06-12T06:25:12.781Z] ACTION: compile -- Passed. Compilation successful
[2025-06-12T06:25:12.781Z] REASON: .class file out of date or does not exist
[2025-06-12T06:25:12.781Z] TIME: 0.171 seconds
[2025-06-12T06:25:12.781Z] messages:
[2025-06-12T06:25:12.781Z] command: compile /home/jenkins/workspace/Test_openjdk11_hs_extended.openjdk_x86-64_linux_testList_5/aqa-tests/openjdk/openjdk-jdk/test/jdk/java/net/httpclient/HttpServerAdapters.java /home/jenkins/workspace/Test_openjdk11_hs_extended.openjdk_x86-64_linux_testList_5/aqa-tests/openjdk/openjdk-jdk/test/jdk/java/net/httpclient/ReferenceTracker.java
[2025-06-12T06:25:12.781Z] reason: .class file out of date or does not exist
[2025-06-12T06:25:12.781Z] started: Thu Jun 12 06:24:54 UTC 2025
[2025-06-12T06:25:12.781Z] Additional options from @modules: --add-modules java.net.http,java.logging,java.base --add-exports java.net.http/jdk.internal.net.http.common=ALL-UNNAMED --add-exports java.net.http/jdk.internal.net.http.frame=ALL-UNNAMED --add-exports java.net.http/jdk.internal.net.http.hpack=ALL-UNNAMED --add-exports java.base/sun.net.www.http=ALL-UNNAMED --add-exports java.base/sun.net.www=ALL-UNNAMED --add-exports java.base/sun.net=ALL-UNNAMED
[2025-06-12T06:25:12.781Z] Mode: agentvm
[2025-06-12T06:25:12.781Z] Agent id: 3
[2025-06-12T06:25:12.781Z] finished: Thu Jun 12 06:24:54 UTC 2025
[2025-06-12T06:25:12.781Z] elapsed time (seconds): 0.171
[2025-06-12T06:25:12.781Z] configuration:
[2025-06-12T06:25:12.781Z] Boot Layer (javac runtime environment)
[2025-06-12T06:25:12.781Z] class path: /home/jenkins/workspace/Test_openjdk11_hs_extended.openjdk_x86-64_linux_testList_5/jvmtest/openjdk/jtreg/lib/javatest.jar
[2025-06-12T06:25:12.781Z] /home/jenkins/workspace/Test_openjdk11_hs_extended.openjdk_x86-64_linux_testList_5/jvmtest/openjdk/jtreg/lib/jtreg.jar
[2025-06-12T06:25:12.781Z] patch: java.base /home/jenkins/workspace/Test_openjdk11_hs_extended.openjdk_x86-64_linux_testList_5/aqa-tests/TKG/output_17497093859969/jdk_net_1/work/patches/java.base
[2025-06-12T06:25:12.781Z]
[2025-06-12T06:25:12.781Z] javac compilation environment
[2025-06-12T06:25:12.781Z] add modules: java.net.http java.logging java.base
[2025-06-12T06:25:12.781Z] add exports: java.base/sun.net ALL-UNNAMED
[2025-06-12T06:25:12.781Z] java.base/sun.net.www ALL-UNNAMED
[2025-06-12T06:25:12.781Z] java.base/sun.net.www.http ALL-UNNAMED
[2025-06-12T06:25:12.781Z] java.net.http/jdk.internal.net.http.common ALL-UNNAMED
[2025-06-12T06:25:12.781Z] java.net.http/jdk.internal.net.http.frame ALL-UNNAMED
[2025-06-12T06:25:12.781Z] java.net.http/jdk.internal.net.http.hpack ALL-UNNAMED
[2025-06-12T06:25:12.781Z] source path: /home/jenkins/workspace/Test_openjdk11_hs_extended.openjdk_x86-64_linux_testList_5/aqa-tests/openjdk/openjdk-jdk/test/lib
[2025-06-12T06:25:12.781Z] /home/jenkins/workspace/Test_openjdk11_hs_extended.openjdk_x86-64_linux_testList_5/aqa-tests/openjdk/openjdk-jdk/test/jdk/java/net/httpclient/http2/server
[2025-06-12T06:25:12.781Z] /home/jenkins/workspace/Test_openjdk11_hs_extended.openjdk_x86-64_linux_testList_5/aqa-tests/openjdk/openjdk-jdk/test/jdk/java/net/httpclient
[2025-06-12T06:25:12.781Z] class path: /home/jenkins/workspace/Test_openjdk11_hs_extended.openjdk_x86-64_linux_testList_5/aqa-tests/TKG/output_17497093859969/jdk_net_1/work/classes/0/test/lib
[2025-06-12T06:25:12.781Z] /home/jenkins/workspace/Test_openjdk11_hs_extended.openjdk_x86-64_linux_testList_5/aqa-tests/TKG/output_17497093859969/jdk_net_1/work/classes/0/java/net/httpclient/http2/server
[2025-06-12T06:25:12.781Z] /home/jenkins/workspace/Test_openjdk11_hs_extended.openjdk_x86-64_linux_testList_5/aqa-tests/TKG/output_17497093859969/jdk_net_1/work/classes/0/java/net/httpclient
[2025-06-12T06:25:12.781Z] /home/jenkins/workspace/Test_openjdk11_hs_extended.openjdk_x86-64_linux_testList_5/jvmtest/openjdk/jtreg/lib/junit-platform-console-standalone-1.9.2.jar
[2025-06-12T06:25:12.781Z]
[2025-06-12T06:25:12.781Z] rerun:
[2025-06-12T06:25:12.781Z] cd /home/jenkins/workspace/Test_openjdk11_hs_extended.openjdk_x86-64_linux_testList_5/aqa-tests/TKG/output_17497093859969/jdk_net_1/work/scratch/0 && \
[2025-06-12T06:25:12.781Z] DISPLAY=:0 \
[2025-06-12T06:25:12.781Z] HOME=/home/jenkins \
[2025-06-12T06:25:12.781Z] LANG=en_US.UTF-8 \
[2025-06-12T06:25:12.781Z] PATH=/bin:/usr/bin:/usr/sbin \
[2025-06-12T06:25:12.781Z] XDG_RUNTIME_DIR=/run/user/1000 \
[2025-06-12T06:25:12.781Z] XDG_SESSION_ID=6533 \
[2025-06-12T06:25:12.781Z] /home/jenkins/workspace/Test_openjdk11_hs_extended.openjdk_x86-64_linux_testList_5/jdkbinary/j2sdk-image/bin/javac \
[2025-06-12T06:25:12.781Z] -J-ea \
[2025-06-12T06:25:12.781Z] -J-esa \
[2025-06-12T06:25:12.781Z] -J-Xmx512m \
[2025-06-12T06:25:12.781Z] -J-XX:-UseCompressedOops \
[2025-06-12T06:25:12.781Z] -J-Dtest.vm.opts='-ea -esa -Xmx512m -XX:-UseCompressedOops' \
[2025-06-12T06:25:12.781Z] -J-Dtest.tool.vm.opts='-J-ea -J-esa -J-Xmx512m -J-XX:-UseCompressedOops' \
[2025-06-12T06:25:12.781Z] -J-Dtest.compiler.opts= \
[2025-06-12T06:25:12.781Z] -J-Dtest.java.opts= \
[2025-06-12T06:25:12.781Z] -J-Dtest.jdk=/home/jenkins/workspace/Test_openjdk11_hs_extended.openjdk_x86-64_linux_testList_5/jdkbinary/j2sdk-image \
[2025-06-12T06:25:12.782Z] -J-Dcompile.jdk=/home/jenkins/workspace/Test_openjdk11_hs_extended.openjdk_x86-64_linux_testList_5/jdkbinary/j2sdk-image \
[2025-06-12T06:25:12.782Z] -J-Dtest.timeout.factor=8.0 \
[2025-06-12T06:25:12.782Z] -J-Dtest.nativepath=/home/jenkins/workspace/Test_openjdk11_hs_extended.openjdk_x86-64_linux_testList_5/jdkbinary/openjdk-test-image/jdk/jtreg/native \
[2025-06-12T06:25:12.782Z] -J-Dtest.root=/home/jenkins/workspace/Test_openjdk11_hs_extended.openjdk_x86-64_linux_testList_5/aqa-tests/openjdk/openjdk-jdk/test/jdk \
[2025-06-12T06:25:12.782Z] -J-Dtest.name=java/net/httpclient/http2/ConnectionReuseTest.java \
[2025-06-12T06:25:12.782Z] -J-Dtest.file=/home/jenkins/workspace/Test_openjdk11_hs_extended.openjdk_x86-64_linux_testList_5/aqa-tests/openjdk/openjdk-jdk/test/jdk/java/net/httpclient/http2/ConnectionReuseTest.java \
[2025-06-12T06:25:12.782Z] -J-Dtest.src=/home/jenkins/workspace/Test_openjdk11_hs_extended.openjdk_x86-64_linux_testList_5/aqa-tests/openjdk/openjdk-jdk/test/jdk/java/net/httpclient/http2 \
[2025-06-12T06:25:12.782Z] -J-Dtest.src.path=/home/jenkins/workspace/Test_openjdk11_hs_extended.openjdk_x86-64_linux_testList_5/aqa-tests/openjdk/openjdk-jdk/test/jdk/java/net/httpclient/http2:/home/jenkins/workspace/Test_openjdk11_hs_extended.openjdk_x86-64_linux_testList_5/aqa-tests/openjdk/openjdk-jdk/test/lib:/home/jenkins/workspace/Test_openjdk11_hs_extended.openjdk_x86-64_linux_testList_5/aqa-tests/openjdk/openjdk-jdk/test/jdk/java/net/httpclient/http2/server:/home/jenkins/workspace/Test_openjdk11_hs_extended.openjdk_x86-64_linux_testList_5/aqa-tests/openjdk/openjdk-jdk/test/jdk/java/net/httpclient \
[2025-06-12T06:25:12.782Z] -J-Dtest.classes=/home/jenkins/workspace/Test_openjdk11_hs_extended.openjdk_x86-64_linux_testList_5/aqa-tests/TKG/output_17497093859969/jdk_net_1/work/classes/0/java/net/httpclient/http2/ConnectionReuseTest.d \
[2025-06-12T06:25:12.782Z] -J-Dtest.class.path=/home/jenkins/workspace/Test_openjdk11_hs_extended.openjdk_x86-64_linux_testList_5/aqa-tests/TKG/output_17497093859969/jdk_net_1/work/classes/0/java/net/httpclient/http2/ConnectionReuseTest.d:/home/jenkins/workspace/Test_openjdk11_hs_extended.openjdk_x86-64_linux_testList_5/aqa-tests/TKG/output_17497093859969/jdk_net_1/work/classes/0/test/lib:/home/jenkins/workspace/Test_openjdk11_hs_extended.openjdk_x86-64_linux_testList_5/aqa-tests/TKG/output_17497093859969/jdk_net_1/work/classes/0/java/net/httpclient/http2/server:/home/jenkins/workspace/Test_openjdk11_hs_extended.openjdk_x86-64_linux_testList_5/aqa-tests/TKG/output_17497093859969/jdk_net_1/work/classes/0/java/net/httpclient \
[2025-06-12T06:25:12.782Z] -J-Dtest.class.path.prefix=/home/jenkins/workspace/Test_openjdk11_hs_extended.openjdk_x86-64_linux_testList_5/aqa-tests/openjdk/openjdk-jdk/test/jdk/java/net/httpclient/http2:/home/jenkins/workspace/Test_openjdk11_hs_extended.openjdk_x86-64_linux_testList_5/aqa-tests/TKG/output_17497093859969/jdk_net_1/work/classes/0/test/lib:/home/jenkins/workspace/Test_openjdk11_hs_extended.openjdk_x86-64_linux_testList_5/aqa-tests/TKG/output_17497093859969/jdk_net_1/work/classes/0/java/net/httpclient/http2/server:/home/jenkins/workspace/Test_openjdk11_hs_extended.openjdk_x86-64_linux_testList_5/aqa-tests/TKG/output_17497093859969/jdk_net_1/work/classes/0/java/net/httpclient \
[2025-06-12T06:25:12.782Z] -J-Dtest.modules='java.net.http/jdk.internal.net.http.common java.net.http/jdk.internal.net.http.frame java.net.http/jdk.internal.net.http.hpack java.logging java.base/sun.net.www.http java.base/sun.net.www java.base/sun.net' \
[2025-06-12T06:25:12.782Z] --add-modules java.net.http,java.logging,java.base \
[2025-06-12T06:25:12.782Z] --add-exports java.net.http/jdk.internal.net.http.common=ALL-UNNAMED \
[2025-06-12T06:25:12.782Z] --add-exports java.net.http/jdk.internal.net.http.frame=ALL-UNNAMED \
[2025-06-12T06:25:12.782Z] --add-exports java.net.http/jdk.internal.net.http.hpack=ALL-UNNAMED \
[2025-06-12T06:25:12.782Z] --add-exports java.base/sun.net.www.http=ALL-UNNAMED \
[2025-06-12T06:25:12.782Z] --add-exports java.base/sun.net.www=ALL-UNNAMED \
[2025-06-12T06:25:12.782Z] --add-exports java.base/sun.net=ALL-UNNAMED \
[2025-06-12T06:25:12.782Z] -d /home/jenkins/workspace/Test_openjdk11_hs_extended.openjdk_x86-64_linux_testList_5/aqa-tests/TKG/output_17497093859969/jdk_net_1/work/classes/0/java/net/httpclient \
[2025-06-12T06:25:12.782Z] -sourcepath /home/jenkins/workspace/Test_openjdk11_hs_extended.openjdk_x86-64_linux_testList_5/aqa-tests/openjdk/openjdk-jdk/test/lib:/home/jenkins/workspace/Test_openjdk11_hs_extended.openjdk_x86-64_linux_testList_5/aqa-tests/openjdk/openjdk-jdk/test/jdk/java/net/httpclient/http2/server:/home/jenkins/workspace/Test_openjdk11_hs_extended.openjdk_x86-64_linux_testList_5/aqa-tests/openjdk/openjdk-jdk/test/jdk/java/net/httpclient \
[2025-06-12T06:25:12.782Z] -classpath /home/jenkins/workspace/Test_openjdk11_hs_extended.openjdk_x86-64_linux_testList_5/aqa-tests/TKG/output_17497093859969/jdk_net_1/work/classes/0/test/lib:/home/jenkins/workspace/Test_openjdk11_hs_extended.openjdk_x86-64_linux_testList_5/aqa-tests/TKG/output_17497093859969/jdk_net_1/work/classes/0/java/net/httpclient/http2/server:/home/jenkins/workspace/Test_openjdk11_hs_extended.openjdk_x86-64_linux_testList_5/aqa-tests/TKG/output_17497093859969/jdk_net_1/work/classes/0/java/net/httpclient:/home/jenkins/workspace/Test_openjdk11_hs_extended.openjdk_x86-64_linux_testList_5/jvmtest/openjdk/jtreg/lib/junit-platform-console-standalone-1.9.2.jar /home/jenkins/workspace/Test_openjdk11_hs_extended.openjdk_x86-64_linux_testList_5/aqa-tests/openjdk/openjdk-jdk/test/jdk/java/net/httpclient/HttpServerAdapters.java /home/jenkins/workspace/Test_openjdk11_hs_extended.openjdk_x86-64_linux_testList_5/aqa-tests/openjdk/openjdk-jdk/test/jdk/java/net/httpclient/ReferenceTracker.java
[2025-06-12T06:25:12.782Z]
[2025-06-12T06:25:12.782Z] ACTION: compile -- Passed. Compilation successful
[2025-06-12T06:25:12.782Z] REASON: .class file out of date or does not exist
[2025-06-12T06:25:12.782Z] TIME: 0.05 seconds
[2025-06-12T06:25:12.782Z] messages:
[2025-06-12T06:25:12.782Z] command: compile /home/jenkins/workspace/Test_openjdk11_hs_extended.openjdk_x86-64_linux_testList_5/aqa-tests/openjdk/openjdk-jdk/test/lib/jdk/test/lib/net/IPSupport.java
[2025-06-12T06:25:12.782Z] reason: .class file out of date or does not exist
[2025-06-12T06:25:12.782Z] started: Thu Jun 12 06:24:54 UTC 2025
[2025-06-12T06:25:12.782Z] Additional options from @modules: --add-modules java.net.http,java.logging,java.base --add-exports java.net.http/jdk.internal.net.http.common=ALL-UNNAMED --add-exports java.net.http/jdk.internal.net.http.frame=ALL-UNNAMED --add-exports java.net.http/jdk.internal.net.http.hpack=ALL-UNNAMED --add-exports java.base/sun.net.www.http=ALL-UNNAMED --add-exports java.base/sun.net.www=ALL-UNNAMED --add-exports java.base/sun.net=ALL-UNNAMED
[2025-06-12T06:25:12.782Z] Mode: agentvm
[2025-06-12T06:25:12.782Z] Agent id: 3
[2025-06-12T06:25:12.782Z] finished: Thu Jun 12 06:24:54 UTC 2025
[2025-06-12T06:25:12.782Z] elapsed time (seconds): 0.05
[2025-06-12T06:25:12.782Z] configuration:
[2025-06-12T06:25:12.782Z] Boot Layer (javac runtime environment)
[2025-06-12T06:25:12.782Z] class path: /home/jenkins/workspace/Test_openjdk11_hs_extended.openjdk_x86-64_linux_testList_5/jvmtest/openjdk/jtreg/lib/javatest.jar
[2025-06-12T06:25:12.782Z] /home/jenkins/workspace/Test_openjdk11_hs_extended.openjdk_x86-64_linux_testList_5/jvmtest/openjdk/jtreg/lib/jtreg.jar
[2025-06-12T06:25:12.782Z] patch: java.base /home/jenkins/workspace/Test_openjdk11_hs_extended.openjdk_x86-64_linux_testList_5/aqa-tests/TKG/output_17497093859969/jdk_net_1/work/patches/java.base
[2025-06-12T06:25:12.782Z]
[2025-06-12T06:25:12.782Z] javac compilation environment
[2025-06-12T06:25:12.782Z] add modules: java.net.http java.logging java.base
[2025-06-12T06:25:12.782Z] add exports: java.base/sun.net ALL-UNNAMED
[2025-06-12T06:25:12.782Z] java.base/sun.net.www ALL-UNNAMED
[2025-06-12T06:25:12.782Z] java.base/sun.net.www.http ALL-UNNAMED
[2025-06-12T06:25:12.782Z] java.net.http/jdk.internal.net.http.common ALL-UNNAMED
[2025-06-12T06:25:12.782Z] java.net.http/jdk.internal.net.http.frame ALL-UNNAMED
[2025-06-12T06:25:12.782Z] java.net.http/jdk.internal.net.http.hpack ALL-UNNAMED
[2025-06-12T06:25:12.782Z] source path: /home/jenkins/workspace/Test_openjdk11_hs_extended.openjdk_x86-64_linux_testList_5/aqa-tests/openjdk/openjdk-jdk/test/lib
[2025-06-12T06:25:12.782Z] /home/jenkins/workspace/Test_openjdk11_hs_extended.openjdk_x86-64_linux_testList_5/aqa-tests/openjdk/openjdk-jdk/test/jdk/java/net/httpclient/http2/server
[2025-06-12T06:25:12.782Z] /home/jenkins/workspace/Test_openjdk11_hs_extended.openjdk_x86-64_linux_testList_5/aqa-tests/openjdk/openjdk-jdk/test/jdk/java/net/httpclient
[2025-06-12T06:25:12.782Z] class path: /home/jenkins/workspace/Test_openjdk11_hs_extended.openjdk_x86-64_linux_testList_5/aqa-tests/TKG/output_17497093859969/jdk_net_1/work/classes/0/test/lib
[2025-06-12T06:25:12.783Z] /home/jenkins/workspace/Test_openjdk11_hs_extended.openjdk_x86-64_linux_testList_5/aqa-tests/TKG/output_17497093859969/jdk_net_1/work/classes/0/java/net/httpclient/http2/server
[2025-06-12T06:25:12.783Z] /home/jenkins/workspace/Test_openjdk11_hs_extended.openjdk_x86-64_linux_testList_5/aqa-tests/TKG/output_17497093859969/jdk_net_1/work/classes/0/java/net/httpclient
[2025-06-12T06:25:12.783Z] /home/jenkins/workspace/Test_openjdk11_hs_extended.openjdk_x86-64_linux_testList_5/jvmtest/openjdk/jtreg/lib/junit-platform-console-standalone-1.9.2.jar
[2025-06-12T06:25:12.783Z]
[2025-06-12T06:25:12.783Z] rerun:
[2025-06-12T06:25:12.783Z] cd /home/jenkins/workspace/Test_openjdk11_hs_extended.openjdk_x86-64_linux_testList_5/aqa-tests/TKG/output_17497093859969/jdk_net_1/work/scratch/0 && \
[2025-06-12T06:25:12.783Z] DISPLAY=:0 \
[2025-06-12T06:25:12.783Z] HOME=/home/jenkins \
[2025-06-12T06:25:12.783Z] LANG=en_US.UTF-8 \
[2025-06-12T06:25:12.783Z] PATH=/bin:/usr/bin:/usr/sbin \
[2025-06-12T06:25:12.783Z] XDG_RUNTIME_DIR=/run/user/1000 \
[2025-06-12T06:25:12.783Z] XDG_SESSION_ID=6533 \
[2025-06-12T06:25:12.783Z] /home/jenkins/workspace/Test_openjdk11_hs_extended.openjdk_x86-64_linux_testList_5/jdkbinary/j2sdk-image/bin/javac \
[2025-06-12T06:25:12.783Z] -J-ea \
[2025-06-12T06:25:12.783Z] -J-esa \
[2025-06-12T06:25:12.783Z] -J-Xmx512m \
[2025-06-12T06:25:12.783Z] -J-XX:-UseCompressedOops \
[2025-06-12T06:25:12.783Z] -J-Dtest.vm.opts='-ea -esa -Xmx512m -XX:-UseCompressedOops' \
[2025-06-12T06:25:12.783Z] -J-Dtest.tool.vm.opts='-J-ea -J-esa -J-Xmx512m -J-XX:-UseCompressedOops' \
[2025-06-12T06:25:12.783Z] -J-Dtest.compiler.opts= \
[2025-06-12T06:25:12.783Z] -J-Dtest.java.opts= \
[2025-06-12T06:25:12.783Z] -J-Dtest.jdk=/home/jenkins/workspace/Test_openjdk11_hs_extended.openjdk_x86-64_linux_testList_5/jdkbinary/j2sdk-image \
[2025-06-12T06:25:12.783Z] -J-Dcompile.jdk=/home/jenkins/workspace/Test_openjdk11_hs_extended.openjdk_x86-64_linux_testList_5/jdkbinary/j2sdk-image \
[2025-06-12T06:25:12.783Z] -J-Dtest.timeout.factor=8.0 \
[2025-06-12T06:25:12.783Z] -J-Dtest.nativepath=/home/jenkins/workspace/Test_openjdk11_hs_extended.openjdk_x86-64_linux_testList_5/jdkbinary/openjdk-test-image/jdk/jtreg/native \
[2025-06-12T06:25:12.783Z] -J-Dtest.root=/home/jenkins/workspace/Test_openjdk11_hs_extended.openjdk_x86-64_linux_testList_5/aqa-tests/openjdk/openjdk-jdk/test/jdk \
[2025-06-12T06:25:12.783Z] -J-Dtest.name=java/net/httpclient/http2/ConnectionReuseTest.java \
[2025-06-12T06:25:12.783Z] -J-Dtest.file=/home/jenkins/workspace/Test_openjdk11_hs_extended.openjdk_x86-64_linux_testList_5/aqa-tests/openjdk/openjdk-jdk/test/jdk/java/net/httpclient/http2/ConnectionReuseTest.java \
[2025-06-12T06:25:12.783Z] -J-Dtest.src=/home/jenkins/workspace/Test_openjdk11_hs_extended.openjdk_x86-64_linux_testList_5/aqa-tests/openjdk/openjdk-jdk/test/jdk/java/net/httpclient/http2 \
[2025-06-12T06:25:12.783Z] -J-Dtest.src.path=/home/jenkins/workspace/Test_openjdk11_hs_extended.openjdk_x86-64_linux_testList_5/aqa-tests/openjdk/openjdk-jdk/test/jdk/java/net/httpclient/http2:/home/jenkins/workspace/Test_openjdk11_hs_extended.openjdk_x86-64_linux_testList_5/aqa-tests/openjdk/openjdk-jdk/test/lib:/home/jenkins/workspace/Test_openjdk11_hs_extended.openjdk_x86-64_linux_testList_5/aqa-tests/openjdk/openjdk-jdk/test/jdk/java/net/httpclient/http2/server:/home/jenkins/workspace/Test_openjdk11_hs_extended.openjdk_x86-64_linux_testList_5/aqa-tests/openjdk/openjdk-jdk/test/jdk/java/net/httpclient \
[2025-06-12T06:25:12.783Z] -J-Dtest.classes=/home/jenkins/workspace/Test_openjdk11_hs_extended.openjdk_x86-64_linux_testList_5/aqa-tests/TKG/output_17497093859969/jdk_net_1/work/classes/0/java/net/httpclient/http2/ConnectionReuseTest.d \
[2025-06-12T06:25:12.783Z] -J-Dtest.class.path=/home/jenkins/workspace/Test_openjdk11_hs_extended.openjdk_x86-64_linux_testList_5/aqa-tests/TKG/output_17497093859969/jdk_net_1/work/classes/0/java/net/httpclient/http2/ConnectionReuseTest.d:/home/jenkins/workspace/Test_openjdk11_hs_extended.openjdk_x86-64_linux_testList_5/aqa-tests/TKG/output_17497093859969/jdk_net_1/work/classes/0/test/lib:/home/jenkins/workspace/Test_openjdk11_hs_extended.openjdk_x86-64_linux_testList_5/aqa-tests/TKG/output_17497093859969/jdk_net_1/work/classes/0/java/net/httpclient/http2/server:/home/jenkins/workspace/Test_openjdk11_hs_extended.openjdk_x86-64_linux_testList_5/aqa-tests/TKG/output_17497093859969/jdk_net_1/work/classes/0/java/net/httpclient \
[2025-06-12T06:25:12.783Z] -J-Dtest.class.path.prefix=/home/jenkins/workspace/Test_openjdk11_hs_extended.openjdk_x86-64_linux_testList_5/aqa-tests/openjdk/openjdk-jdk/test/jdk/java/net/httpclient/http2:/home/jenkins/workspace/Test_openjdk11_hs_extended.openjdk_x86-64_linux_testList_5/aqa-tests/TKG/output_17497093859969/jdk_net_1/work/classes/0/test/lib:/home/jenkins/workspace/Test_openjdk11_hs_extended.openjdk_x86-64_linux_testList_5/aqa-tests/TKG/output_17497093859969/jdk_net_1/work/classes/0/java/net/httpclient/http2/server:/home/jenkins/workspace/Test_openjdk11_hs_extended.openjdk_x86-64_linux_testList_5/aqa-tests/TKG/output_17497093859969/jdk_net_1/work/classes/0/java/net/httpclient \
[2025-06-12T06:25:12.783Z] -J-Dtest.modules='java.net.http/jdk.internal.net.http.common java.net.http/jdk.internal.net.http.frame java.net.http/jdk.internal.net.http.hpack java.logging java.base/sun.net.www.http java.base/sun.net.www java.base/sun.net' \
[2025-06-12T06:25:12.783Z] --add-modules java.net.http,java.logging,java.base \
[2025-06-12T06:25:12.783Z] --add-exports java.net.http/jdk.internal.net.http.common=ALL-UNNAMED \
[2025-06-12T06:25:12.783Z] --add-exports java.net.http/jdk.internal.net.http.frame=ALL-UNNAMED \
[2025-06-12T06:25:12.783Z] --add-exports java.net.http/jdk.internal.net.http.hpack=ALL-UNNAMED \
[2025-06-12T06:25:12.783Z] --add-exports java.base/sun.net.www.http=ALL-UNNAMED \
[2025-06-12T06:25:12.783Z] --add-exports java.base/sun.net.www=ALL-UNNAMED \
[2025-06-12T06:25:12.783Z] --add-exports java.base/sun.net=ALL-UNNAMED \
[2025-06-12T06:25:12.783Z] -d /home/jenkins/workspace/Test_openjdk11_hs_extended.openjdk_x86-64_linux_testList_5/aqa-tests/TKG/output_17497093859969/jdk_net_1/work/classes/0/test/lib \
[2025-06-12T06:25:12.783Z] -sourcepath /home/jenkins/workspace/Test_openjdk11_hs_extended.openjdk_x86-64_linux_testList_5/aqa-tests/openjdk/openjdk-jdk/test/lib:/home/jenkins/workspace/Test_openjdk11_hs_extended.openjdk_x86-64_linux_testList_5/aqa-tests/openjdk/openjdk-jdk/test/jdk/java/net/httpclient/http2/server:/home/jenkins/workspace/Test_openjdk11_hs_extended.openjdk_x86-64_linux_testList_5/aqa-tests/openjdk/openjdk-jdk/test/jdk/java/net/httpclient \
[2025-06-12T06:25:12.783Z] -classpath /home/jenkins/workspace/Test_openjdk11_hs_extended.openjdk_x86-64_linux_testList_5/aqa-tests/TKG/output_17497093859969/jdk_net_1/work/classes/0/test/lib:/home/jenkins/workspace/Test_openjdk11_hs_extended.openjdk_x86-64_linux_testList_5/aqa-tests/TKG/output_17497093859969/jdk_net_1/work/classes/0/java/net/httpclient/http2/server:/home/jenkins/workspace/Test_openjdk11_hs_extended.openjdk_x86-64_linux_testList_5/aqa-tests/TKG/output_17497093859969/jdk_net_1/work/classes/0/java/net/httpclient:/home/jenkins/workspace/Test_openjdk11_hs_extended.openjdk_x86-64_linux_testList_5/jvmtest/openjdk/jtreg/lib/junit-platform-console-standalone-1.9.2.jar /home/jenkins/workspace/Test_openjdk11_hs_extended.openjdk_x86-64_linux_testList_5/aqa-tests/openjdk/openjdk-jdk/test/lib/jdk/test/lib/net/IPSupport.java
[2025-06-12T06:25:12.783Z]
[2025-06-12T06:25:12.783Z] ACTION: build -- Passed. Build successful
[2025-06-12T06:25:12.783Z] REASON: Named class compiled on demand
[2025-06-12T06:25:12.783Z] TIME: 0.143 seconds
[2025-06-12T06:25:12.783Z] messages:
[2025-06-12T06:25:12.783Z] command: build ConnectionReuseTest
[2025-06-12T06:25:12.783Z] reason: Named class compiled on demand
[2025-06-12T06:25:12.783Z] started: Thu Jun 12 06:24:54 UTC 2025
[2025-06-12T06:25:12.783Z] Test directory:
[2025-06-12T06:25:12.783Z] compile: ConnectionReuseTest
[2025-06-12T06:25:12.783Z] finished: Thu Jun 12 06:24:54 UTC 2025
[2025-06-12T06:25:12.783Z] elapsed time (seconds): 0.143
[2025-06-12T06:25:12.783Z]
[2025-06-12T06:25:12.783Z] ACTION: compile -- Passed. Compilation successful
[2025-06-12T06:25:12.783Z] REASON: .class file out of date or does not exist
[2025-06-12T06:25:12.783Z] TIME: 0.142 seconds
[2025-06-12T06:25:12.783Z] messages:
[2025-06-12T06:25:12.783Z] command: compile /home/jenkins/workspace/Test_openjdk11_hs_extended.openjdk_x86-64_linux_testList_5/aqa-tests/openjdk/openjdk-jdk/test/jdk/java/net/httpclient/http2/ConnectionReuseTest.java
[2025-06-12T06:25:12.783Z] reason: .class file out of date or does not exist
[2025-06-12T06:25:12.783Z] started: Thu Jun 12 06:24:54 UTC 2025
[2025-06-12T06:25:12.783Z] Additional options from @modules: --add-modules java.net.http,java.logging,java.base --add-exports java.net.http/jdk.internal.net.http.common=ALL-UNNAMED --add-exports java.net.http/jdk.internal.net.http.frame=ALL-UNNAMED --add-exports java.net.http/jdk.internal.net.http.hpack=ALL-UNNAMED --add-exports java.base/sun.net.www.http=ALL-UNNAMED --add-exports java.base/sun.net.www=ALL-UNNAMED --add-exports java.base/sun.net=ALL-UNNAMED
[2025-06-12T06:25:12.783Z] Mode: agentvm
[2025-06-12T06:25:12.783Z] Agent id: 3
[2025-06-12T06:25:12.783Z] finished: Thu Jun 12 06:24:54 UTC 2025
[2025-06-12T06:25:12.783Z] elapsed time (seconds): 0.142
[2025-06-12T06:25:12.783Z] configuration:
[2025-06-12T06:25:12.783Z] Boot Layer (javac runtime environment)
[2025-06-12T06:25:12.783Z] class path: /home/jenkins/workspace/Test_openjdk11_hs_extended.openjdk_x86-64_linux_testList_5/jvmtest/openjdk/jtreg/lib/javatest.jar
[2025-06-12T06:25:12.783Z] /home/jenkins/workspace/Test_openjdk11_hs_extended.openjdk_x86-64_linux_testList_5/jvmtest/openjdk/jtreg/lib/jtreg.jar
[2025-06-12T06:25:12.783Z] patch: java.base /home/jenkins/workspace/Test_openjdk11_hs_extended.openjdk_x86-64_linux_testList_5/aqa-tests/TKG/output_17497093859969/jdk_net_1/work/patches/java.base
[2025-06-12T06:25:12.783Z]
[2025-06-12T06:25:12.783Z] javac compilation environment
[2025-06-12T06:25:12.783Z] add modules: java.net.http java.logging java.base
[2025-06-12T06:25:12.783Z] add exports: java.base/sun.net ALL-UNNAMED
[2025-06-12T06:25:12.783Z] java.base/sun.net.www ALL-UNNAMED
[2025-06-12T06:25:12.783Z] java.base/sun.net.www.http ALL-UNNAMED
[2025-06-12T06:25:12.783Z] java.net.http/jdk.internal.net.http.common ALL-UNNAMED
[2025-06-12T06:25:12.784Z] java.net.http/jdk.internal.net.http.frame ALL-UNNAMED
[2025-06-12T06:25:12.784Z] java.net.http/jdk.internal.net.http.hpack ALL-UNNAMED
[2025-06-12T06:25:12.784Z] source path: /home/jenkins/workspace/Test_openjdk11_hs_extended.openjdk_x86-64_linux_testList_5/aqa-tests/openjdk/openjdk-jdk/test/jdk/java/net/httpclient/http2
[2025-06-12T06:25:12.784Z] /home/jenkins/workspace/Test_openjdk11_hs_extended.openjdk_x86-64_linux_testList_5/aqa-tests/openjdk/openjdk-jdk/test/lib
[2025-06-12T06:25:12.784Z] /home/jenkins/workspace/Test_openjdk11_hs_extended.openjdk_x86-64_linux_testList_5/aqa-tests/openjdk/openjdk-jdk/test/jdk/java/net/httpclient/http2/server
[2025-06-12T06:25:12.784Z] /home/jenkins/workspace/Test_openjdk11_hs_extended.openjdk_x86-64_linux_testList_5/aqa-tests/openjdk/openjdk-jdk/test/jdk/java/net/httpclient
[2025-06-12T06:25:12.784Z] class path: /home/jenkins/workspace/Test_openjdk11_hs_extended.openjdk_x86-64_linux_testList_5/aqa-tests/openjdk/openjdk-jdk/test/jdk/java/net/httpclient/http2
[2025-06-12T06:25:12.784Z] /home/jenkins/workspace/Test_openjdk11_hs_extended.openjdk_x86-64_linux_testList_5/aqa-tests/TKG/output_17497093859969/jdk_net_1/work/classes/0/java/net/httpclient/http2/ConnectionReuseTest.d
[2025-06-12T06:25:12.784Z] /home/jenkins/workspace/Test_openjdk11_hs_extended.openjdk_x86-64_linux_testList_5/aqa-tests/TKG/output_17497093859969/jdk_net_1/work/classes/0/test/lib
[2025-06-12T06:25:12.784Z] /home/jenkins/workspace/Test_openjdk11_hs_extended.openjdk_x86-64_linux_testList_5/aqa-tests/TKG/output_17497093859969/jdk_net_1/work/classes/0/java/net/httpclient/http2/server
[2025-06-12T06:25:12.784Z] /home/jenkins/workspace/Test_openjdk11_hs_extended.openjdk_x86-64_linux_testList_5/aqa-tests/TKG/output_17497093859969/jdk_net_1/work/classes/0/java/net/httpclient
[2025-06-12T06:25:12.784Z] /home/jenkins/workspace/Test_openjdk11_hs_extended.openjdk_x86-64_linux_testList_5/jvmtest/openjdk/jtreg/lib/junit-platform-console-standalone-1.9.2.jar
[2025-06-12T06:25:12.784Z]
[2025-06-12T06:25:12.784Z] rerun:
[2025-06-12T06:25:12.784Z] cd /home/jenkins/workspace/Test_openjdk11_hs_extended.openjdk_x86-64_linux_testList_5/aqa-tests/TKG/output_17497093859969/jdk_net_1/work/scratch/0 && \
[2025-06-12T06:25:12.784Z] DISPLAY=:0 \
[2025-06-12T06:25:12.784Z] HOME=/home/jenkins \
[2025-06-12T06:25:12.784Z] LANG=en_US.UTF-8 \
[2025-06-12T06:25:12.784Z] PATH=/bin:/usr/bin:/usr/sbin \
[2025-06-12T06:25:12.784Z] XDG_RUNTIME_DIR=/run/user/1000 \
[2025-06-12T06:25:12.784Z] XDG_SESSION_ID=6533 \
[2025-06-12T06:25:12.784Z] /home/jenkins/workspace/Test_openjdk11_hs_extended.openjdk_x86-64_linux_testList_5/jdkbinary/j2sdk-image/bin/javac \
[2025-06-12T06:25:12.784Z] -J-ea \
[2025-06-12T06:25:12.784Z] -J-esa \
[2025-06-12T06:25:12.784Z] -J-Xmx512m \
[2025-06-12T06:25:12.784Z] -J-XX:-UseCompressedOops \
[2025-06-12T06:25:12.784Z] -J-Dtest.vm.opts='-ea -esa -Xmx512m -XX:-UseCompressedOops' \
[2025-06-12T06:25:12.784Z] -J-Dtest.tool.vm.opts='-J-ea -J-esa -J-Xmx512m -J-XX:-UseCompressedOops' \
[2025-06-12T06:25:12.784Z] -J-Dtest.compiler.opts= \
[2025-06-12T06:25:12.784Z] -J-Dtest.java.opts= \
[2025-06-12T06:25:12.784Z] -J-Dtest.jdk=/home/jenkins/workspace/Test_openjdk11_hs_extended.openjdk_x86-64_linux_testList_5/jdkbinary/j2sdk-image \
[2025-06-12T06:25:12.784Z] -J-Dcompile.jdk=/home/jenkins/workspace/Test_openjdk11_hs_extended.openjdk_x86-64_linux_testList_5/jdkbinary/j2sdk-image \
[2025-06-12T06:25:12.784Z] -J-Dtest.timeout.factor=8.0 \
[2025-06-12T06:25:12.784Z] -J-Dtest.nativepath=/home/jenkins/workspace/Test_openjdk11_hs_extended.openjdk_x86-64_linux_testList_5/jdkbinary/openjdk-test-image/jdk/jtreg/native \
[2025-06-12T06:25:12.784Z] -J-Dtest.root=/home/jenkins/workspace/Test_openjdk11_hs_extended.openjdk_x86-64_linux_testList_5/aqa-tests/openjdk/openjdk-jdk/test/jdk \
[2025-06-12T06:25:12.784Z] -J-Dtest.name=java/net/httpclient/http2/ConnectionReuseTest.java \
[2025-06-12T06:25:12.784Z] -J-Dtest.file=/home/jenkins/workspace/Test_openjdk11_hs_extended.openjdk_x86-64_linux_testList_5/aqa-tests/openjdk/openjdk-jdk/test/jdk/java/net/httpclient/http2/ConnectionReuseTest.java \
[2025-06-12T06:25:12.784Z] -J-Dtest.src=/home/jenkins/workspace/Test_openjdk11_hs_extended.openjdk_x86-64_linux_testList_5/aqa-tests/openjdk/openjdk-jdk/test/jdk/java/net/httpclient/http2 \
[2025-06-12T06:25:12.784Z] -J-Dtest.src.path=/home/jenkins/workspace/Test_openjdk11_hs_extended.openjdk_x86-64_linux_testList_5/aqa-tests/openjdk/openjdk-jdk/test/jdk/java/net/httpclient/http2:/home/jenkins/workspace/Test_openjdk11_hs_extended.openjdk_x86-64_linux_testList_5/aqa-tests/openjdk/openjdk-jdk/test/lib:/home/jenkins/workspace/Test_openjdk11_hs_extended.openjdk_x86-64_linux_testList_5/aqa-tests/openjdk/openjdk-jdk/test/jdk/java/net/httpclient/http2/server:/home/jenkins/workspace/Test_openjdk11_hs_extended.openjdk_x86-64_linux_testList_5/aqa-tests/openjdk/openjdk-jdk/test/jdk/java/net/httpclient \
[2025-06-12T06:25:12.784Z] -J-Dtest.classes=/home/jenkins/workspace/Test_openjdk11_hs_extended.openjdk_x86-64_linux_testList_5/aqa-tests/TKG/output_17497093859969/jdk_net_1/work/classes/0/java/net/httpclient/http2/ConnectionReuseTest.d \
[2025-06-12T06:25:12.784Z] -J-Dtest.class.path=/home/jenkins/workspace/Test_openjdk11_hs_extended.openjdk_x86-64_linux_testList_5/aqa-tests/TKG/output_17497093859969/jdk_net_1/work/classes/0/java/net/httpclient/http2/ConnectionReuseTest.d:/home/jenkins/workspace/Test_openjdk11_hs_extended.openjdk_x86-64_linux_testList_5/aqa-tests/TKG/output_17497093859969/jdk_net_1/work/classes/0/test/lib:/home/jenkins/workspace/Test_openjdk11_hs_extended.openjdk_x86-64_linux_testList_5/aqa-tests/TKG/output_17497093859969/jdk_net_1/work/classes/0/java/net/httpclient/http2/server:/home/jenkins/workspace/Test_openjdk11_hs_extended.openjdk_x86-64_linux_testList_5/aqa-tests/TKG/output_17497093859969/jdk_net_1/work/classes/0/java/net/httpclient \
[2025-06-12T06:25:12.784Z] -J-Dtest.class.path.prefix=/home/jenkins/workspace/Test_openjdk11_hs_extended.openjdk_x86-64_linux_testList_5/aqa-tests/TKG/output_17497093859969/jdk_net_1/work/classes/0/java/net/httpclient/http2/ConnectionReuseTest.d:/home/jenkins/workspace/Test_openjdk11_hs_extended.openjdk_x86-64_linux_testList_5/aqa-tests/openjdk/openjdk-jdk/test/jdk/java/net/httpclient/http2:/home/jenkins/workspace/Test_openjdk11_hs_extended.openjdk_x86-64_linux_testList_5/aqa-tests/TKG/output_17497093859969/jdk_net_1/work/classes/0/test/lib:/home/jenkins/workspace/Test_openjdk11_hs_extended.openjdk_x86-64_linux_testList_5/aqa-tests/TKG/output_17497093859969/jdk_net_1/work/classes/0/java/net/httpclient/http2/server:/home/jenkins/workspace/Test_openjdk11_hs_extended.openjdk_x86-64_linux_testList_5/aqa-tests/TKG/output_17497093859969/jdk_net_1/work/classes/0/java/net/httpclient \
[2025-06-12T06:25:12.784Z] -J-Dtest.modules='java.net.http/jdk.internal.net.http.common java.net.http/jdk.internal.net.http.frame java.net.http/jdk.internal.net.http.hpack java.logging java.base/sun.net.www.http java.base/sun.net.www java.base/sun.net' \
[2025-06-12T06:25:12.784Z] --add-modules java.net.http,java.logging,java.base \
[2025-06-12T06:25:12.784Z] --add-exports java.net.http/jdk.internal.net.http.common=ALL-UNNAMED \
[2025-06-12T06:25:12.784Z] --add-exports java.net.http/jdk.internal.net.http.frame=ALL-UNNAMED \
[2025-06-12T06:25:12.784Z] --add-exports java.net.http/jdk.internal.net.http.hpack=ALL-UNNAMED \
[2025-06-12T06:25:12.784Z] --add-exports java.base/sun.net.www.http=ALL-UNNAMED \
[2025-06-12T06:25:12.784Z] --add-exports java.base/sun.net.www=ALL-UNNAMED \
[2025-06-12T06:25:12.784Z] --add-exports java.base/sun.net=ALL-UNNAMED \
[2025-06-12T06:25:12.784Z] -d /home/jenkins/workspace/Test_openjdk11_hs_extended.openjdk_x86-64_linux_testList_5/aqa-tests/TKG/output_17497093859969/jdk_net_1/work/classes/0/java/net/httpclient/http2/ConnectionReuseTest.d \
[2025-06-12T06:25:12.784Z] -sourcepath /home/jenkins/workspace/Test_openjdk11_hs_extended.openjdk_x86-64_linux_testList_5/aqa-tests/openjdk/openjdk-jdk/test/jdk/java/net/httpclient/http2:/home/jenkins/workspace/Test_openjdk11_hs_extended.openjdk_x86-64_linux_testList_5/aqa-tests/openjdk/openjdk-jdk/test/lib:/home/jenkins/workspace/Test_openjdk11_hs_extended.openjdk_x86-64_linux_testList_5/aqa-tests/openjdk/openjdk-jdk/test/jdk/java/net/httpclient/http2/server:/home/jenkins/workspace/Test_openjdk11_hs_extended.openjdk_x86-64_linux_testList_5/aqa-tests/openjdk/openjdk-jdk/test/jdk/java/net/httpclient \
[2025-06-12T06:25:12.784Z] -classpath /home/jenkins/workspace/Test_openjdk11_hs_extended.openjdk_x86-64_linux_testList_5/aqa-tests/openjdk/openjdk-jdk/test/jdk/java/net/httpclient/http2:/home/jenkins/workspace/Test_openjdk11_hs_extended.openjdk_x86-64_linux_testList_5/aqa-tests/TKG/output_17497093859969/jdk_net_1/work/classes/0/java/net/httpclient/http2/ConnectionReuseTest.d:/home/jenkins/workspace/Test_openjdk11_hs_extended.openjdk_x86-64_linux_testList_5/aqa-tests/TKG/output_17497093859969/jdk_net_1/work/classes/0/test/lib:/home/jenkins/workspace/Test_openjdk11_hs_extended.openjdk_x86-64_linux_testList_5/aqa-tests/TKG/output_17497093859969/jdk_net_1/work/classes/0/java/net/httpclient/http2/server:/home/jenkins/workspace/Test_openjdk11_hs_extended.openjdk_x86-64_linux_testList_5/aqa-tests/TKG/output_17497093859969/jdk_net_1/work/classes/0/java/net/httpclient:/home/jenkins/workspace/Test_openjdk11_hs_extended.openjdk_x86-64_linux_testList_5/jvmtest/openjdk/jtreg/lib/junit-platform-console-standalone-1.9.2.jar /home/jenkins/workspace/Test_openjdk11_hs_extended.openjdk_x86-64_linux_testList_5/aqa-tests/openjdk/openjdk-jdk/test/jdk/java/net/httpclient/http2/ConnectionReuseTest.java
[2025-06-12T06:25:12.784Z]
[2025-06-12T06:25:12.784Z] ACTION: junit -- Passed. Execution successful
[2025-06-12T06:25:12.784Z] REASON: User specified action: run junit/othervm ConnectionReuseTest
[2025-06-12T06:25:12.784Z] TIME: 3.197 seconds
[2025-06-12T06:25:12.784Z] messages:
[2025-06-12T06:25:12.784Z] command: junit ConnectionReuseTest
[2025-06-12T06:25:12.784Z] reason: User specified action: run junit/othervm ConnectionReuseTest
[2025-06-12T06:25:12.784Z] started: Thu Jun 12 06:24:54 UTC 2025
[2025-06-12T06:25:12.785Z] Mode: othervm [/othervm specified]
[2025-06-12T06:25:12.785Z] Additional options from @modules: --add-modules java.net.http,java.logging,java.base --add-exports java.net.http/jdk.internal.net.http.common=ALL-UNNAMED --add-exports java.net.http/jdk.internal.net.http.frame=ALL-UNNAMED --add-exports java.net.http/jdk.internal.net.http.hpack=ALL-UNNAMED --add-exports java.base/sun.net.www.http=ALL-UNNAMED --add-exports java.base/sun.net.www=ALL-UNNAMED --add-exports java.base/sun.net=ALL-UNNAMED
[2025-06-12T06:25:12.785Z] finished: Thu Jun 12 06:24:57 UTC 2025
[2025-06-12T06:25:12.785Z] elapsed time (seconds): 3.197
[2025-06-12T06:25:12.785Z] configuration:
[2025-06-12T06:25:12.785Z] Boot Layer
[2025-06-12T06:25:12.785Z] add modules: java.net.http java.logging java.base
[2025-06-12T06:25:12.785Z] add exports: java.base/sun.net ALL-UNNAMED
[2025-06-12T06:25:12.785Z] java.base/sun.net.www ALL-UNNAMED
[2025-06-12T06:25:12.785Z] java.base/sun.net.www.http ALL-UNNAMED
[2025-06-12T06:25:12.785Z] java.net.http/jdk.internal.net.http.common ALL-UNNAMED
[2025-06-12T06:25:12.785Z] java.net.http/jdk.internal.net.http.frame ALL-UNNAMED
[2025-06-12T06:25:12.785Z] java.net.http/jdk.internal.net.http.hpack ALL-UNNAMED
[2025-06-12T06:25:12.785Z]
[2025-06-12T06:25:12.785Z] STDOUT:
[2025-06-12T06:25:12.785Z] Http2TestServerImpl[localhost/127.0.0.1:60291]::addHandler ConnectionReuseTest$Handler@22fcbcf3, /
[2025-06-12T06:25:12.785Z] Http2TestServerImpl: start
[2025-06-12T06:25:12.785Z] Started HTTP v2 server at localhost:60291
[2025-06-12T06:25:12.785Z] Http2TestServerImpl[localhost/127.0.0.1:50433]::addHandler ConnectionReuseTest$Handler@16638b3e, /
[2025-06-12T06:25:12.785Z] Http2TestServerImpl: start
[2025-06-12T06:25:12.785Z] Started HTTPS v2 server at localhost:50433
[2025-06-12T06:25:12.785Z] Issuing request(1) https://localhost:50433/ GET
[2025-06-12T06:25:12.785Z] Http2TestContext::handle Http2TestExchangeImpl: Http2TestExchangeImpl@168e696f
[2025-06-12T06:25:12.785Z] Handling request https://localhost:50433/ from /127.0.0.1:54258
[2025-06-12T06:25:12.785Z] Server side handler responded to a request from /127.0.0.1:54258
[2025-06-12T06:25:12.785Z] Issuing request(2) https://localhost:50433/ GET
[2025-06-12T06:25:12.785Z] Http2TestContext::handle Http2TestExchangeImpl: Http2TestExchangeImpl@2b584d5c
[2025-06-12T06:25:12.785Z] Handling request https://localhost:50433/ from /127.0.0.1:54258
[2025-06-12T06:25:12.785Z] Server side handler responded to a request from /127.0.0.1:54258
[2025-06-12T06:25:12.785Z] Issuing request(3) https://localhost:50433/ GET
[2025-06-12T06:25:12.785Z] Http2TestContext::handle Http2TestExchangeImpl: Http2TestExchangeImpl@360875a6
[2025-06-12T06:25:12.785Z] Handling request https://localhost:50433/ from /127.0.0.1:54258
[2025-06-12T06:25:12.785Z] Server side handler responded to a request from /127.0.0.1:54258
[2025-06-12T06:25:12.785Z] Issuing request(4) https://localhost:50433/ GET
[2025-06-12T06:25:12.785Z] Http2TestContext::handle Http2TestExchangeImpl: Http2TestExchangeImpl@3e7ee313
[2025-06-12T06:25:12.785Z] Handling request https://localhost:50433/ from /127.0.0.1:54258
[2025-06-12T06:25:12.785Z] Server side handler responded to a request from /127.0.0.1:54258
[2025-06-12T06:25:12.785Z] Issuing request(5) https://localhost:50433/ GET
[2025-06-12T06:25:12.785Z] Http2TestContext::handle Http2TestExchangeImpl: Http2TestExchangeImpl@655920d0
[2025-06-12T06:25:12.785Z] Handling request https://localhost:50433/ from /127.0.0.1:54258
[2025-06-12T06:25:12.785Z] Server side handler responded to a request from /127.0.0.1:54258
[2025-06-12T06:25:12.785Z] PASSED: No outstanding operations found in 1 clients
[2025-06-12T06:25:12.785Z] Issuing request(1) http://localhost:60291/ GET
[2025-06-12T06:25:12.785Z] Http2TestContext::handle Http2TestExchangeImpl: Http2TestExchangeImpl@3e6bdc09
[2025-06-12T06:25:12.785Z] Handling request http://localhost:60291/ from /127.0.0.1:53658
[2025-06-12T06:25:12.785Z] Server side handler responded to a request from /127.0.0.1:53658
[2025-06-12T06:25:12.785Z] Issuing request(2) http://localhost:60291/ GET
[2025-06-12T06:25:12.785Z] Http2TestContext::handle Http2TestExchangeImpl: Http2TestExchangeImpl@3a544f1c
[2025-06-12T06:25:12.785Z] Handling request http://localhost:60291/ from /127.0.0.1:53658
[2025-06-12T06:25:12.785Z] Server side handler responded to a request from /127.0.0.1:53658
[2025-06-12T06:25:12.785Z] Issuing request(3) http://localhost:60291/ GET
[2025-06-12T06:25:12.785Z] Http2TestContext::handle Http2TestExchangeImpl: Http2TestExchangeImpl@7f56d632
[2025-06-12T06:25:12.785Z] Handling request http://localhost:60291/ from /127.0.0.1:53658
[2025-06-12T06:25:12.785Z] Server side handler responded to a request from /127.0.0.1:53658
[2025-06-12T06:25:12.785Z] Issuing request(4) http://localhost:60291/ GET
[2025-06-12T06:25:12.785Z] Http2TestContext::handle Http2TestExchangeImpl: Http2TestExchangeImpl@2e8802f0
[2025-06-12T06:25:12.785Z] Handling request http://localhost:60291/ from /127.0.0.1:53658
[2025-06-12T06:25:12.785Z] Server side handler responded to a request from /127.0.0.1:53658
[2025-06-12T06:25:12.785Z] Issuing request(5) http://localhost:60291/ GET
[2025-06-12T06:25:12.785Z] Http2TestContext::handle Http2TestExchangeImpl: Http2TestExchangeImpl@4ee308bc
[2025-06-12T06:25:12.785Z] Handling request http://localhost:60291/ from /127.0.0.1:53658
[2025-06-12T06:25:12.785Z] Server side handler responded to a request from /127.0.0.1:53658
[2025-06-12T06:25:12.785Z] PASSED: No outstanding operations found in 2 clients
[2025-06-12T06:25:12.785Z] Stopping server HttpServerAdapters$HttpTestServer$Http2TestServerImpl@7ac9d0d2
[2025-06-12T06:25:12.785Z] Http2TestServerImpl: stop
[2025-06-12T06:25:12.785Z] Stopping server HttpServerAdapters$HttpTestServer$Http2TestServerImpl@426239f3
[2025-06-12T06:25:12.785Z] Http2TestServerImpl: stop
[2025-06-12T06:25:12.785Z] STDERR:
[2025-06-12T06:25:12.785Z] STARTED ConnectionReuseTest::testConnReuse '[1] https://localhost:50433/'
[2025-06-12T06:25:12.785Z] TestServer: New connection from Socket[addr=/127.0.0.1,port=54258,localport=50433]
[2025-06-12T06:25:12.785Z] TestServer: GET /
[2025-06-12T06:25:12.785Z] Server: got END_STREAM for stream 1
[2025-06-12T06:25:12.785Z] Using handler for: /
[2025-06-12T06:25:12.785Z] Sent response headers 200
[2025-06-12T06:25:12.785Z] TestServer: GET /
[2025-06-12T06:25:12.785Z] Server: got END_STREAM for stream 3
[2025-06-12T06:25:12.785Z] Using handler for: /
[2025-06-12T06:25:12.785Z] Sent response headers 200
[2025-06-12T06:25:12.785Z] TestServer: GET /
[2025-06-12T06:25:12.785Z] Server: got END_STREAM for stream 5
[2025-06-12T06:25:12.785Z] Using handler for: /
[2025-06-12T06:25:12.785Z] Sent response headers 200
[2025-06-12T06:25:12.785Z] TestServer: GET /
[2025-06-12T06:25:12.785Z] Server: got END_STREAM for stream 7
[2025-06-12T06:25:12.785Z] Using handler for: /
[2025-06-12T06:25:12.785Z] Sent response headers 200
[2025-06-12T06:25:12.785Z] TestServer: GET /
[2025-06-12T06:25:12.785Z] Server: got END_STREAM for stream 9
[2025-06-12T06:25:12.785Z] Using handler for: /
[2025-06-12T06:25:12.785Z] Sent response headers 200
[2025-06-12T06:25:12.785Z] SUCCESSFUL ConnectionReuseTest::testConnReuse '[1] https://localhost:50433/'
[2025-06-12T06:25:12.785Z] STARTED ConnectionReuseTest::testConnReuse '[2] http://localhost:60291/'
[2025-06-12T06:25:12.785Z] TestServer: New connection from Socket[addr=/127.0.0.1,port=53658,localport=60291]
[2025-06-12T06:25:12.785Z] TestServer: GET /
[2025-06-12T06:25:12.785Z] Server: creating input stream for stream 1
[2025-06-12T06:25:12.785Z] Using handler for: /
[2025-06-12T06:25:12.785Z] Sent response headers 200
[2025-06-12T06:25:12.785Z] TestServer: GET /
[2025-06-12T06:25:12.785Z] Server: got END_STREAM for stream 3
[2025-06-12T06:25:12.785Z] Using handler for: /
[2025-06-12T06:25:12.785Z] Sent response headers 200
[2025-06-12T06:25:12.785Z] TestServer: GET /
[2025-06-12T06:25:12.785Z] Server: got END_STREAM for stream 5
[2025-06-12T06:25:12.786Z] Using handler for: /
[2025-06-12T06:25:12.786Z] Sent response headers 200
[2025-06-12T06:25:12.786Z] TestServer: GET /
[2025-06-12T06:25:12.786Z] Server: got END_STREAM for stream 7
[2025-06-12T06:25:12.786Z] Using handler for: /
[2025-06-12T06:25:12.786Z] Sent response headers 200
[2025-06-12T06:25:12.786Z] TestServer: GET /
[2025-06-12T06:25:12.786Z] Server: got END_STREAM for stream 9
[2025-06-12T06:25:12.786Z] Using handler for: /
[2025-06-12T06:25:12.786Z] Sent response headers 200
[2025-06-12T06:25:12.786Z] SUCCESSFUL ConnectionReuseTest::testConnReuse '[2] http://localhost:60291/'
[2025-06-12T06:25:12.786Z] Server stopping 1 connections
[2025-06-12T06:25:12.786Z] Server connection to /127.0.0.1:54258 stopping. 5 streams
[2025-06-12T06:25:12.786Z] TestServer: Connection writer stopping
[2025-06-12T06:25:12.786Z] Server stopping 1 connections
[2025-06-12T06:25:12.786Z] Server connection to /127.0.0.1:53658 stopping. 5 streams
[2025-06-12T06:25:12.786Z] TestServer: Connection writer stopping
[2025-06-12T06:25:12.786Z]
[2025-06-12T06:25:12.786Z] [ JUnit Containers: found 5, started 5, succeeded 5, failed 0, aborted 0, skipped 0]
[2025-06-12T06:25:12.786Z] [ JUnit Tests: found 2, started 2, succeeded 2, failed 0, aborted 0, skipped 0]
[2025-06-12T06:25:12.786Z]
[2025-06-12T06:25:12.786Z] STATUS:Passed.
[2025-06-12T06:25:12.786Z] rerun:
[2025-06-12T06:25:12.786Z] cd /home/jenkins/workspace/Test_openjdk11_hs_extended.openjdk_x86-64_linux_testList_5/aqa-tests/TKG/output_17497093859969/jdk_net_1/work/scratch/0 && \
[2025-06-12T06:25:12.786Z] DISPLAY=:0 \
[2025-06-12T06:25:12.786Z] HOME=/home/jenkins \
[2025-06-12T06:25:12.786Z] LANG=en_US.UTF-8 \
[2025-06-12T06:25:12.786Z] PATH=/bin:/usr/bin:/usr/sbin \
[2025-06-12T06:25:12.786Z] XDG_RUNTIME_DIR=/run/user/1000 \
[2025-06-12T06:25:12.786Z] XDG_SESSION_ID=6533 \
[2025-06-12T06:25:12.786Z] CLASSPATH=/home/jenkins/workspace/Test_openjdk11_hs_extended.openjdk_x86-64_linux_testList_5/aqa-tests/TKG/output_17497093859969/jdk_net_1/work/classes/0/java/net/httpclient/http2/ConnectionReuseTest.d:/home/jenkins/workspace/Test_openjdk11_hs_extended.openjdk_x86-64_linux_testList_5/aqa-tests/openjdk/openjdk-jdk/test/jdk/java/net/httpclient/http2:/home/jenkins/workspace/Test_openjdk11_hs_extended.openjdk_x86-64_linux_testList_5/aqa-tests/TKG/output_17497093859969/jdk_net_1/work/classes/0/test/lib:/home/jenkins/workspace/Test_openjdk11_hs_extended.openjdk_x86-64_linux_testList_5/aqa-tests/openjdk/openjdk-jdk/test/lib:/home/jenkins/workspace/Test_openjdk11_hs_extended.openjdk_x86-64_linux_testList_5/aqa-tests/TKG/output_17497093859969/jdk_net_1/work/classes/0/java/net/httpclient/http2/server:/home/jenkins/workspace/Test_openjdk11_hs_extended.openjdk_x86-64_linux_testList_5/aqa-tests/openjdk/openjdk-jdk/test/jdk/java/net/httpclient/http2/server:/home/jenkins/workspace/Test_openjdk11_hs_extended.openjdk_x86-64_linux_testList_5/aqa-tests/TKG/output_17497093859969/jdk_net_1/work/classes/0/java/net/httpclient:/home/jenkins/workspace/Test_openjdk11_hs_extended.openjdk_x86-64_linux_testList_5/aqa-tests/openjdk/openjdk-jdk/test/jdk/java/net/httpclient:/home/jenkins/workspace/Test_openjdk11_hs_extended.openjdk_x86-64_linux_testList_5/jvmtest/openjdk/jtreg/lib/junit-platform-console-standalone-1.9.2.jar:/home/jenkins/workspace/Test_openjdk11_hs_extended.openjdk_x86-64_linux_testList_5/jvmtest/openjdk/jtreg/lib/javatest.jar:/home/jenkins/workspace/Test_openjdk11_hs_extended.openjdk_x86-64_linux_testList_5/jvmtest/openjdk/jtreg/lib/jtreg.jar \
[2025-06-12T06:25:12.786Z] /home/jenkins/workspace/Test_openjdk11_hs_extended.openjdk_x86-64_linux_testList_5/jdkbinary/j2sdk-image/bin/java \
[2025-06-12T06:25:12.786Z] -Dtest.vm.opts='-ea -esa -Xmx512m -XX:-UseCompressedOops' \
[2025-06-12T06:25:12.786Z] -Dtest.tool.vm.opts='-J-ea -J-esa -J-Xmx512m -J-XX:-UseCompressedOops' \
[2025-06-12T06:25:12.786Z] -Dtest.compiler.opts= \
[2025-06-12T06:25:12.786Z] -Dtest.java.opts= \
[2025-06-12T06:25:12.786Z] -Dtest.jdk=/home/jenkins/workspace/Test_openjdk11_hs_extended.openjdk_x86-64_linux_testList_5/jdkbinary/j2sdk-image \
[2025-06-12T06:25:12.786Z] -Dcompile.jdk=/home/jenkins/workspace/Test_openjdk11_hs_extended.openjdk_x86-64_linux_testList_5/jdkbinary/j2sdk-image \
[2025-06-12T06:25:12.786Z] -Dtest.timeout.factor=8.0 \
[2025-06-12T06:25:12.786Z] -Dtest.nativepath=/home/jenkins/workspace/Test_openjdk11_hs_extended.openjdk_x86-64_linux_testList_5/jdkbinary/openjdk-test-image/jdk/jtreg/native \
[2025-06-12T06:25:12.786Z] -Dtest.root=/home/jenkins/workspace/Test_openjdk11_hs_extended.openjdk_x86-64_linux_testList_5/aqa-tests/openjdk/openjdk-jdk/test/jdk \
[2025-06-12T06:25:12.786Z] -Dtest.name=java/net/httpclient/http2/ConnectionReuseTest.java \
[2025-06-12T06:25:12.786Z] -Dtest.file=/home/jenkins/workspace/Test_openjdk11_hs_extended.openjdk_x86-64_linux_testList_5/aqa-tests/openjdk/openjdk-jdk/test/jdk/java/net/httpclient/http2/ConnectionReuseTest.java \
[2025-06-12T06:25:12.786Z] -Dtest.src=/home/jenkins/workspace/Test_openjdk11_hs_extended.openjdk_x86-64_linux_testList_5/aqa-tests/openjdk/openjdk-jdk/test/jdk/java/net/httpclient/http2 \
[2025-06-12T06:25:12.786Z] -Dtest.src.path=/home/jenkins/workspace/Test_openjdk11_hs_extended.openjdk_x86-64_linux_testList_5/aqa-tests/openjdk/openjdk-jdk/test/jdk/java/net/httpclient/http2:/home/jenkins/workspace/Test_openjdk11_hs_extended.openjdk_x86-64_linux_testList_5/aqa-tests/openjdk/openjdk-jdk/test/lib:/home/jenkins/workspace/Test_openjdk11_hs_extended.openjdk_x86-64_linux_testList_5/aqa-tests/openjdk/openjdk-jdk/test/jdk/java/net/httpclient/http2/server:/home/jenkins/workspace/Test_openjdk11_hs_extended.openjdk_x86-64_linux_testList_5/aqa-tests/openjdk/openjdk-jdk/test/jdk/java/net/httpclient \
[2025-06-12T06:25:12.786Z] -Dtest.classes=/home/jenkins/workspace/Test_openjdk11_hs_extended.openjdk_x86-64_linux_testList_5/aqa-tests/TKG/output_17497093859969/jdk_net_1/work/classes/0/java/net/httpclient/http2/ConnectionReuseTest.d \
[2025-06-12T06:25:12.786Z] -Dtest.class.path=/home/jenkins/workspace/Test_openjdk11_hs_extended.openjdk_x86-64_linux_testList_5/aqa-tests/TKG/output_17497093859969/jdk_net_1/work/classes/0/java/net/httpclient/http2/ConnectionReuseTest.d:/home/jenkins/workspace/Test_openjdk11_hs_extended.openjdk_x86-64_linux_testList_5/aqa-tests/TKG/output_17497093859969/jdk_net_1/work/classes/0/test/lib:/home/jenkins/workspace/Test_openjdk11_hs_extended.openjdk_x86-64_linux_testList_5/aqa-tests/TKG/output_17497093859969/jdk_net_1/work/classes/0/java/net/httpclient/http2/server:/home/jenkins/workspace/Test_openjdk11_hs_extended.openjdk_x86-64_linux_testList_5/aqa-tests/TKG/output_17497093859969/jdk_net_1/work/classes/0/java/net/httpclient \
[2025-06-12T06:25:12.786Z] -Dtest.class.path.prefix=/home/jenkins/workspace/Test_openjdk11_hs_extended.openjdk_x86-64_linux_testList_5/aqa-tests/TKG/output_17497093859969/jdk_net_1/work/classes/0/java/net/httpclient/http2/ConnectionReuseTest.d:/home/jenkins/workspace/Test_openjdk11_hs_extended.openjdk_x86-64_linux_testList_5/aqa-tests/openjdk/openjdk-jdk/test/jdk/java/net/httpclient/http2:/home/jenkins/workspace/Test_openjdk11_hs_extended.openjdk_x86-64_linux_testList_5/aqa-tests/TKG/output_17497093859969/jdk_net_1/work/classes/0/test/lib:/home/jenkins/workspace/Test_openjdk11_hs_extended.openjdk_x86-64_linux_testList_5/aqa-tests/TKG/output_17497093859969/jdk_net_1/work/classes/0/java/net/httpclient/http2/server:/home/jenkins/workspace/Test_openjdk11_hs_extended.openjdk_x86-64_linux_testList_5/aqa-tests/TKG/output_17497093859969/jdk_net_1/work/classes/0/java/net/httpclient \
[2025-06-12T06:25:12.786Z] -Dtest.modules='java.net.http/jdk.internal.net.http.common java.net.http/jdk.internal.net.http.frame java.net.http/jdk.internal.net.http.hpack java.logging java.base/sun.net.www.http java.base/sun.net.www java.base/sun.net' \
[2025-06-12T06:25:12.786Z] --add-modules java.net.http,java.logging,java.base \
[2025-06-12T06:25:12.786Z] --add-exports java.net.http/jdk.internal.net.http.common=ALL-UNNAMED \
[2025-06-12T06:25:12.786Z] --add-exports java.net.http/jdk.internal.net.http.frame=ALL-UNNAMED \
[2025-06-12T06:25:12.786Z] --add-exports java.net.http/jdk.internal.net.http.hpack=ALL-UNNAMED \
[2025-06-12T06:25:12.786Z] --add-exports java.base/sun.net.www.http=ALL-UNNAMED \
[2025-06-12T06:25:12.786Z] --add-exports java.base/sun.net.www=ALL-UNNAMED \
[2025-06-12T06:25:12.786Z] --add-exports java.base/sun.net=ALL-UNNAMED \
[2025-06-12T06:25:12.786Z] -ea \
[2025-06-12T06:25:12.786Z] -esa \
[2025-06-12T06:25:12.786Z] -Xmx512m \
[2025-06-12T06:25:12.786Z] -XX:-UseCompressedOops \
[2025-06-12T06:25:12.786Z] -Djava.library.path=/home/jenkins/workspace/Test_openjdk11_hs_extended.openjdk_x86-64_linux_testList_5/jdkbinary/openjdk-test-image/jdk/jtreg/native \
[2025-06-12T06:25:12.786Z] com.sun.javatest.regtest.agent.MainWrapper /home/jenkins/workspace/Test_openjdk11_hs_extended.openjdk_x86-64_linux_testList_5/aqa-tests/TKG/output_17497093859969/jdk_net_1/work/java/net/httpclient/http2/ConnectionReuseTest.d/junit.0.jta java/net/httpclient/http2/ConnectionReuseTest.java ConnectionReuseTest
[2025-06-12T06:25:12.786Z]
[2025-06-12T06:25:12.786Z] ACTION: build -- Passed. All files up to date
[2025-06-12T06:25:12.786Z] REASON: Named class compiled on demand
[2025-06-12T06:25:12.786Z] TIME: 0.0 seconds
[2025-06-12T06:25:12.786Z] messages:
[2025-06-12T06:25:12.786Z] command: build ConnectionReuseTest
[2025-06-12T06:25:12.786Z] reason: Named class compiled on demand
[2025-06-12T06:25:12.786Z] started: Thu Jun 12 06:24:57 UTC 2025
[2025-06-12T06:25:12.786Z] finished: Thu Jun 12 06:24:57 UTC 2025
[2025-06-12T06:25:12.786Z] elapsed time (seconds): 0.0
[2025-06-12T06:25:12.786Z]
[2025-06-12T06:25:12.786Z] ACTION: junit -- Failed. Execution failed: `main' threw exception: java.lang.Exception: JUnit test failure
[2025-06-12T06:25:12.786Z] REASON: User specified action: run junit/othervm -Djava.net.preferIPv6Addresses=true ConnectionReuseTest
[2025-06-12T06:25:12.786Z] TIME: 3.275 seconds
[2025-06-12T06:25:12.786Z] messages:
[2025-06-12T06:25:12.786Z] command: junit -Djava.net.preferIPv6Addresses=true ConnectionReuseTest
[2025-06-12T06:25:12.786Z] reason: User specified action: run junit/othervm -Djava.net.preferIPv6Addresses=true ConnectionReuseTest
[2025-06-12T06:25:12.786Z] started: Thu Jun 12 06:24:57 UTC 2025
[2025-06-12T06:25:12.786Z] Mode: othervm [/othervm specified]
[2025-06-12T06:25:12.786Z] Additional options from @modules: --add-modules java.net.http,java.logging,java.base --add-exports java.net.http/jdk.internal.net.http.common=ALL-UNNAMED --add-exports java.net.http/jdk.internal.net.http.frame=ALL-UNNAMED --add-exports java.net.http/jdk.internal.net.http.hpack=ALL-UNNAMED --add-exports java.base/sun.net.www.http=ALL-UNNAMED --add-exports java.base/sun.net.www=ALL-UNNAMED --add-exports java.base/sun.net=ALL-UNNAMED
[2025-06-12T06:25:12.786Z] finished: Thu Jun 12 06:25:00 UTC 2025
[2025-06-12T06:25:12.786Z] elapsed time (seconds): 3.275
[2025-06-12T06:25:12.786Z] configuration:
[2025-06-12T06:25:12.786Z] Boot Layer
[2025-06-12T06:25:12.786Z] add modules: java.net.http java.logging java.base
[2025-06-12T06:25:12.786Z] add exports: java.base/sun.net ALL-UNNAMED
[2025-06-12T06:25:12.786Z] java.base/sun.net.www ALL-UNNAMED
[2025-06-12T06:25:12.786Z] java.base/sun.net.www.http ALL-UNNAMED
[2025-06-12T06:25:12.786Z] java.net.http/jdk.internal.net.http.common ALL-UNNAMED
[2025-06-12T06:25:12.786Z] java.net.http/jdk.internal.net.http.frame ALL-UNNAMED
[2025-06-12T06:25:12.787Z] java.net.http/jdk.internal.net.http.hpack ALL-UNNAMED
[2025-06-12T06:25:12.787Z]
[2025-06-12T06:25:12.787Z] STDOUT:
[2025-06-12T06:25:12.787Z] Http2TestServerImpl[localhost/0:0:0:0:0:0:0:1:43417]::addHandler ConnectionReuseTest$Handler@6c671f6c, /
[2025-06-12T06:25:12.787Z] Http2TestServerImpl: start
[2025-06-12T06:25:12.787Z] Started HTTP v2 server at localhost:43417
[2025-06-12T06:25:12.787Z] Http2TestServerImpl[localhost/0:0:0:0:0:0:0:1:58595]::addHandler ConnectionReuseTest$Handler@120fe72e, /
[2025-06-12T06:25:12.787Z] Http2TestServerImpl: start
[2025-06-12T06:25:12.787Z] Started HTTPS v2 server at localhost:58595
[2025-06-12T06:25:12.787Z] Issuing request(1) https://localhost:58595/ GET
[2025-06-12T06:25:12.787Z] PASSED: No outstanding operations found in 1 clients
[2025-06-12T06:25:12.787Z] Issuing request(1) http://localhost:43417/ GET
[2025-06-12T06:25:12.787Z] PASSED: No outstanding operations found in 2 clients
[2025-06-12T06:25:12.787Z] Issuing request(1) http://[::1]:43417/ GET
[2025-06-12T06:25:12.787Z] Http2TestContext::handle Http2TestExchangeImpl: Http2TestExchangeImpl@2f64b235
[2025-06-12T06:25:12.787Z] Handling request http://[::1]:43417/ from /0:0:0:0:0:0:0:1:37930
[2025-06-12T06:25:12.787Z] Server side handler responded to a request from /0:0:0:0:0:0:0:1:37930
[2025-06-12T06:25:12.787Z] Issuing request(2) http://[::1]:43417/ GET
[2025-06-12T06:25:12.787Z] Http2TestContext::handle Http2TestExchangeImpl: Http2TestExchangeImpl@7fff689d
[2025-06-12T06:25:12.787Z] Handling request http://[::1]:43417/ from /0:0:0:0:0:0:0:1:37930
[2025-06-12T06:25:12.787Z] Server side handler responded to a request from /0:0:0:0:0:0:0:1:37930
[2025-06-12T06:25:12.787Z] Issuing request(3) http://[::1]:43417/ GET
[2025-06-12T06:25:12.787Z] Http2TestContext::handle Http2TestExchangeImpl: Http2TestExchangeImpl@3a1653c3
[2025-06-12T06:25:12.787Z] Handling request http://[::1]:43417/ from /0:0:0:0:0:0:0:1:37930
[2025-06-12T06:25:12.787Z] Server side handler responded to a request from /0:0:0:0:0:0:0:1:37930
[2025-06-12T06:25:12.787Z] Issuing request(4) http://[::1]:43417/ GET
[2025-06-12T06:25:12.787Z] Http2TestContext::handle Http2TestExchangeImpl: Http2TestExchangeImpl@74873edd
[2025-06-12T06:25:12.787Z] Handling request http://[::1]:43417/ from /0:0:0:0:0:0:0:1:37930
[2025-06-12T06:25:12.787Z] Server side handler responded to a request from /0:0:0:0:0:0:0:1:37930
[2025-06-12T06:25:12.787Z] Issuing request(5) http://[::1]:43417/ GET
[2025-06-12T06:25:12.787Z] Http2TestContext::handle Http2TestExchangeImpl: Http2TestExchangeImpl@282eab4b
[2025-06-12T06:25:12.787Z] Handling request http://[::1]:43417/ from /0:0:0:0:0:0:0:1:37930
[2025-06-12T06:25:12.787Z] Server side handler responded to a request from /0:0:0:0:0:0:0:1:37930
[2025-06-12T06:25:12.787Z] PASSED: No outstanding operations found in 3 clients
[2025-06-12T06:25:12.787Z] Stopping server HttpServerAdapters$HttpTestServer$Http2TestServerImpl@3749dcc4
[2025-06-12T06:25:12.787Z] Http2TestServerImpl: stop
[2025-06-12T06:25:12.787Z] Stopping server HttpServerAdapters$HttpTestServer$Http2TestServerImpl@23b39e26
[2025-06-12T06:25:12.787Z] Http2TestServerImpl: stop
[2025-06-12T06:25:12.787Z] STDERR:
[2025-06-12T06:25:12.787Z] IPSupport - IPv4: true
[2025-06-12T06:25:12.787Z] IPSupport - IPv6: true
[2025-06-12T06:25:12.787Z] preferIPv4Stack: false
[2025-06-12T06:25:12.787Z] preferIPv6Addresses: true
[2025-06-12T06:25:12.787Z] STARTED ConnectionReuseTest::testConnReuse '[1] https://localhost:58595/'
[2025-06-12T06:25:12.787Z] java.net.ConnectException: Connection refused
[2025-06-12T06:25:12.787Z] at java.net.http/jdk.internal.net.http.HttpClientImpl.send(HttpClientImpl.java:562)
[2025-06-12T06:25:12.787Z] at java.net.http/jdk.internal.net.http.HttpClientFacade.send(HttpClientFacade.java:119)
[2025-06-12T06:25:12.787Z] at ConnectionReuseTest.testConnReuse(ConnectionReuseTest.java:147)
[2025-06-12T06:25:12.787Z] at java.base/jdk.internal.reflect.NativeMethodAccessorImpl.invoke0(Native Method)
[2025-06-12T06:25:12.787Z] at java.base/jdk.internal.reflect.NativeMethodAccessorImpl.invoke(NativeMethodAccessorImpl.java:62)
[2025-06-12T06:25:12.787Z] at java.base/jdk.internal.reflect.DelegatingMethodAccessorImpl.invoke(DelegatingMethodAccessorImpl.java:43)
[2025-06-12T06:25:12.787Z] at java.base/java.lang.reflect.Method.invoke(Method.java:566)
[2025-06-12T06:25:12.787Z] at org.junit.platform.commons.util.ReflectionUtils.invokeMethod(ReflectionUtils.java:727)
[2025-06-12T06:25:12.787Z] at org.junit.jupiter.engine.execution.MethodInvocation.proceed(MethodInvocation.java:60)
[2025-06-12T06:25:12.787Z] at org.junit.jupiter.engine.execution.InvocationInterceptorChain$ValidatingInvocation.proceed(InvocationInterceptorChain.java:131)
[2025-06-12T06:25:12.787Z] at org.junit.jupiter.engine.extension.TimeoutExtension.intercept(TimeoutExtension.java:156)
[2025-06-12T06:25:12.787Z] at org.junit.jupiter.engine.extension.TimeoutExtension.interceptTestableMethod(TimeoutExtension.java:147)
[2025-06-12T06:25:12.787Z] at org.junit.jupiter.engine.extension.TimeoutExtension.interceptTestTemplateMethod(TimeoutExtension.java:94)
[2025-06-12T06:25:12.787Z] at org.junit.jupiter.engine.execution.InterceptingExecutableInvoker$ReflectiveInterceptorCall.lambda$ofVoidMethod$0(InterceptingExecutableInvoker.java:103)
[2025-06-12T06:25:12.787Z] at org.junit.jupiter.engine.execution.InterceptingExecutableInvoker.lambda$invoke$0(InterceptingExecutableInvoker.java:93)
[2025-06-12T06:25:12.787Z] at org.junit.jupiter.engine.execution.InvocationInterceptorChain$InterceptedInvocation.proceed(InvocationInterceptorChain.java:106)
[2025-06-12T06:25:12.787Z] at org.junit.jupiter.engine.execution.InvocationInterceptorChain.proceed(InvocationInterceptorChain.java:64)
[2025-06-12T06:25:12.787Z] at org.junit.jupiter.engine.execution.InvocationInterceptorChain.chainAndInvoke(InvocationInterceptorChain.java:45)
[2025-06-12T06:25:12.787Z] at org.junit.jupiter.engine.execution.InvocationInterceptorChain.invoke(InvocationInterceptorChain.java:37)
[2025-06-12T06:25:12.787Z] at org.junit.jupiter.engine.execution.InterceptingExecutableInvoker.invoke(InterceptingExecutableInvoker.java:92)
[2025-06-12T06:25:12.787Z] at org.junit.jupiter.engine.execution.InterceptingExecutableInvoker.invoke(InterceptingExecutableInvoker.java:86)
[2025-06-12T06:25:12.787Z] at org.junit.jupiter.engine.descriptor.TestMethodTestDescriptor.lambda$invokeTestMethod$7(TestMethodTestDescriptor.java:217)
[2025-06-12T06:25:12.787Z] at org.junit.platform.engine.support.hierarchical.ThrowableCollector.execute(ThrowableCollector.java:73)
[2025-06-12T06:25:12.787Z] at org.junit.jupiter.engine.descriptor.TestMethodTestDescriptor.invokeTestMethod(TestMethodTestDescriptor.java:213)
[2025-06-12T06:25:12.787Z] at org.junit.jupiter.engine.descriptor.TestMethodTestDescriptor.execute(TestMethodTestDescriptor.java:138)
[2025-06-12T06:25:12.787Z] at org.junit.jupiter.engine.descriptor.TestMethodTestDescriptor.execute(TestMethodTestDescriptor.java:68)
[2025-06-12T06:25:12.787Z] at org.junit.platform.engine.support.hierarchical.NodeTestTask.lambda$executeRecursively$6(NodeTestTask.java:151)
[2025-06-12T06:25:12.787Z] at org.junit.platform.engine.support.hierarchical.ThrowableCollector.execute(ThrowableCollector.java:73)
[2025-06-12T06:25:12.789Z] at org.junit.platform.engine.support.hierarchical.NodeTestTask.lambda$executeRecursively$8(NodeTestTask.java:141)
[2025-06-12T06:25:12.789Z] at org.junit.platform.engine.support.hierarchical.Node.around(Node.java:137)
[2025-06-12T06:25:12.789Z] at org.junit.platform.engine.support.hierarchical.NodeTestTask.lambda$executeRecursively$9(NodeTestTask.java:139)
[2025-06-12T06:25:12.789Z] at org.junit.platform.engine.support.hierarchical.ThrowableCollector.execute(ThrowableCollector.java:73)
[2025-06-12T06:25:12.789Z] at org.junit.platform.engine.support.hierarchical.NodeTestTask.executeRecursively(NodeTestTask.java:138)
[2025-06-12T06:25:12.789Z] at org.junit.platform.engine.support.hierarchical.NodeTestTask.execute(NodeTestTask.java:95)
[2025-06-12T06:25:12.789Z] at org.junit.platform.engine.support.hierarchical.SameThreadHierarchicalTestExecutorService.submit(SameThreadHierarchicalTestExecutorService.java:35)
[2025-06-12T06:25:12.789Z] at org.junit.platform.engine.support.hierarchical.NodeTestTask$DefaultDynamicTestExecutor.execute(NodeTestTask.java:226)
[2025-06-12T06:25:12.789Z] at org.junit.platform.engine.support.hierarchical.NodeTestTask$DefaultDynamicTestExecutor.execute(NodeTestTask.java:204)
[2025-06-12T06:25:12.789Z] at org.junit.jupiter.engine.descriptor.TestTemplateTestDescriptor.execute(TestTemplateTestDescriptor.java:142)
[2025-06-12T06:25:12.789Z] at org.junit.jupiter.engine.descriptor.TestTemplateTestDescriptor.lambda$execute$2(TestTemplateTestDescriptor.java:110)
[2025-06-12T06:25:12.789Z] at java.base/java.util.stream.ForEachOps$ForEachOp$OfRef.accept(ForEachOps.java:183)
[2025-06-12T06:25:12.789Z] at java.base/java.util.stream.ReferencePipeline$3$1.accept(ReferencePipeline.java:195)
[2025-06-12T06:25:12.789Z] at java.base/java.util.stream.ReferencePipeline$2$1.accept(ReferencePipeline.java:177)
[2025-06-12T06:25:12.789Z] at java.base/java.util.stream.ReferencePipeline$3$1.accept(ReferencePipeline.java:195)
[2025-06-12T06:25:12.789Z] at java.base/java.util.stream.ForEachOps$ForEachOp$OfRef.accept(ForEachOps.java:183)
[2025-06-12T06:25:12.789Z] at java.base/java.util.stream.ReferencePipeline$3$1.accept(ReferencePipeline.java:195)
[2025-06-12T06:25:12.789Z] at java.base/java.util.stream.ReferencePipeline$3$1.accept(ReferencePipeline.java:195)
[2025-06-12T06:25:12.789Z] at java.base/java.util.stream.ReferencePipeline$3$1.accept(ReferencePipeline.java:195)
[2025-06-12T06:25:12.789Z] at java.base/java.util.stream.ForEachOps$ForEachOp$OfRef.accept(ForEachOps.java:183)
[2025-06-12T06:25:12.789Z] at java.base/java.util.stream.ReferencePipeline$3$1.accept(ReferencePipeline.java:195)
[2025-06-12T06:25:12.789Z] at java.base/java.util.ArrayList$ArrayListSpliterator.forEachRemaining(ArrayList.java:1655)
[2025-06-12T06:25:12.789Z] at java.base/java.util.stream.ReferencePipeline$Head.forEach(ReferencePipeline.java:658)
[2025-06-12T06:25:12.789Z] at java.base/java.util.stream.ReferencePipeline$7$1.accept(ReferencePipeline.java:274)
[2025-06-12T06:25:12.789Z] at java.base/java.util.stream.ReferencePipeline$3$1.accept(ReferencePipeline.java:195)
[2025-06-12T06:25:12.789Z] at java.base/java.util.stream.ReferencePipeline$3$1.accept(ReferencePipeline.java:195)
[2025-06-12T06:25:12.789Z] at java.base/java.util.Spliterators$ArraySpliterator.forEachRemaining(Spliterators.java:948)
[2025-06-12T06:25:12.789Z] at java.base/java.util.stream.AbstractPipeline.copyInto(AbstractPipeline.java:484)
[2025-06-12T06:25:12.789Z] at java.base/java.util.stream.AbstractPipeline.wrapAndCopyInto(AbstractPipeline.java:474)
[2025-06-12T06:25:12.789Z] at java.base/java.util.stream.ForEachOps$ForEachOp.evaluateSequential(ForEachOps.java:150)
[2025-06-12T06:25:12.789Z] at java.base/java.util.stream.ForEachOps$ForEachOp$OfRef.evaluateSequential(ForEachOps.java:173)
[2025-06-12T06:25:12.789Z] at java.base/java.util.stream.AbstractPipeline.evaluate(AbstractPipeline.java:234)
[2025-06-12T06:25:12.789Z] at java.base/java.util.stream.ReferencePipeline.forEach(ReferencePipeline.java:497)
[2025-06-12T06:25:12.789Z] at java.base/java.util.stream.ReferencePipeline$7$1.accept(ReferencePipeline.java:274)
[2025-06-12T06:25:12.789Z] at java.base/java.util.stream.ReferencePipeline$3$1.accept(ReferencePipeline.java:195)
[2025-06-12T06:25:12.789Z] at java.base/java.util.stream.ReferencePipeline$3$1.accept(ReferencePipeline.java:195)
[2025-06-12T06:25:12.789Z] at java.base/java.util.stream.ReferencePipeline$3$1.accept(ReferencePipeline.java:195)
[2025-06-12T06:25:12.789Z] at java.base/java.util.ArrayList$ArrayListSpliterator.forEachRemaining(ArrayList.java:1655)
[2025-06-12T06:25:12.789Z] at java.base/java.util.stream.AbstractPipeline.copyInto(AbstractPipeline.java:484)
[2025-06-12T06:25:12.789Z] at java.base/java.util.stream.AbstractPipeline.wrapAndCopyInto(AbstractPipeline.java:474)
[2025-06-12T06:25:12.789Z] at java.base/java.util.stream.ForEachOps$ForEachOp.evaluateSequential(ForEachOps.java:150)
[2025-06-12T06:25:12.789Z] at java.base/java.util.stream.ForEachOps$ForEachOp$OfRef.evaluateSequential(ForEachOps.java:173)
[2025-06-12T06:25:12.789Z] at java.base/java.util.stream.AbstractPipeline.evaluate(AbstractPipeline.java:234)
[2025-06-12T06:25:12.789Z] at java.base/java.util.stream.ReferencePipeline.forEach(ReferencePipeline.java:497)
[2025-06-12T06:25:12.789Z] at java.base/java.util.stream.ReferencePipeline$7$1.accept(ReferencePipeline.java:274)
[2025-06-12T06:25:12.789Z] at java.base/java.util.ArrayList$ArrayListSpliterator.forEachRemaining(ArrayList.java:1655)
[2025-06-12T06:25:12.789Z] at java.base/java.util.stream.AbstractPipeline.copyInto(AbstractPipeline.java:484)
[2025-06-12T06:25:12.789Z] at java.base/java.util.stream.AbstractPipeline.wrapAndCopyInto(AbstractPipeline.java:474)
[2025-06-12T06:25:12.789Z] at java.base/java.util.stream.ForEachOps$ForEachOp.evaluateSequential(ForEachOps.java:150)
[2025-06-12T06:25:12.789Z] at java.base/java.util.stream.ForEachOps$ForEachOp$OfRef.evaluateSequential(ForEachOps.java:173)
[2025-06-12T06:25:12.789Z] at java.base/java.util.stream.AbstractPipeline.evaluate(AbstractPipeline.java:234)
[2025-06-12T06:25:12.789Z] at java.base/java.util.stream.ReferencePipeline.forEach(ReferencePipeline.java:497)
[2025-06-12T06:25:12.789Z] at org.junit.jupiter.engine.descriptor.TestTemplateTestDescriptor.execute(TestTemplateTestDescriptor.java:110)
[2025-06-12T06:25:12.789Z] at org.junit.jupiter.engine.descriptor.TestTemplateTestDescriptor.execute(TestTemplateTestDescriptor.java:44)
[2025-06-12T06:25:12.789Z] at org.junit.platform.engine.support.hierarchical.NodeTestTask.lambda$executeRecursively$6(NodeTestTask.java:151)
[2025-06-12T06:25:12.789Z] at org.junit.platform.engine.support.hierarchical.ThrowableCollector.execute(ThrowableCollector.java:73)
[2025-06-12T06:25:12.789Z] at org.junit.platform.engine.support.hierarchical.NodeTestTask.lambda$executeRecursively$8(NodeTestTask.java:141)
[2025-06-12T06:25:12.789Z] at org.junit.platform.engine.support.hierarchical.Node.around(Node.java:137)
[2025-06-12T06:25:12.789Z] at org.junit.platform.engine.support.hierarchical.NodeTestTask.lambda$executeRecursively$9(NodeTestTask.java:139)
[2025-06-12T06:25:12.789Z] at org.junit.platform.engine.support.hierarchical.ThrowableCollector.execute(ThrowableCollector.java:73)
[2025-06-12T06:25:12.789Z] at org.junit.platform.engine.support.hierarchical.NodeTestTask.executeRecursively(NodeTestTask.java:138)
[2025-06-12T06:25:12.789Z] at org.junit.platform.engine.support.hierarchical.NodeTestTask.execute(NodeTestTask.java:95)
[2025-06-12T06:25:12.789Z] at java.base/java.util.ArrayList.forEach(ArrayList.java:1541)
[2025-06-12T06:25:12.789Z] at org.junit.platform.engine.support.hierarchical.SameThreadHierarchicalTestExecutorService.invokeAll(SameThreadHierarchicalTestExecutorService.java:41)
[2025-06-12T06:25:12.789Z] at org.junit.platform.engine.support.hierarchical.NodeTestTask.lambda$executeRecursively$6(NodeTestTask.java:155)
[2025-06-12T06:25:12.790Z] at org.junit.platform.engine.support.hierarchical.ThrowableCollector.execute(ThrowableCollector.java:73)
[2025-06-12T06:25:12.790Z] at org.junit.platform.engine.support.hierarchical.NodeTestTask.lambda$executeRecursively$8(NodeTestTask.java:141)
[2025-06-12T06:25:12.790Z] at org.junit.platform.engine.support.hierarchical.Node.around(Node.java:137)
[2025-06-12T06:25:12.790Z] at org.junit.platform.engine.support.hierarchical.NodeTestTask.lambda$executeRecursively$9(NodeTestTask.java:139)
[2025-06-12T06:25:12.790Z] at org.junit.platform.engine.support.hierarchical.ThrowableCollector.execute(ThrowableCollector.java:73)
[2025-06-12T06:25:12.790Z] at org.junit.platform.engine.support.hierarchical.NodeTestTask.executeRecursively(NodeTestTask.java:138)
[2025-06-12T06:25:12.790Z] at org.junit.platform.engine.support.hierarchical.NodeTestTask.execute(NodeTestTask.java:95)
[2025-06-12T06:25:12.790Z] at java.base/java.util.ArrayList.forEach(ArrayList.java:1541)
[2025-06-12T06:25:12.790Z] at org.junit.platform.engine.support.hierarchical.SameThreadHierarchicalTestExecutorService.invokeAll(SameThreadHierarchicalTestExecutorService.java:41)
[2025-06-12T06:25:12.790Z] at org.junit.platform.engine.support.hierarchical.NodeTestTask.lambda$executeRecursively$6(NodeTestTask.java:155)
[2025-06-12T06:25:12.790Z] at org.junit.platform.engine.support.hierarchical.ThrowableCollector.execute(ThrowableCollector.java:73)
[2025-06-12T06:25:12.790Z] at org.junit.platform.engine.support.hierarchical.NodeTestTask.lambda$executeRecursively$8(NodeTestTask.java:141)
[2025-06-12T06:25:12.790Z] at org.junit.platform.engine.support.hierarchical.Node.around(Node.java:137)
[2025-06-12T06:25:12.790Z] at org.junit.platform.engine.support.hierarchical.NodeTestTask.lambda$executeRecursively$9(NodeTestTask.java:139)
[2025-06-12T06:25:12.790Z] at org.junit.platform.engine.support.hierarchical.ThrowableCollector.execute(ThrowableCollector.java:73)
[2025-06-12T06:25:12.790Z] at org.junit.platform.engine.support.hierarchical.NodeTestTask.executeRecursively(NodeTestTask.java:138)
[2025-06-12T06:25:12.790Z] at org.junit.platform.engine.support.hierarchical.NodeTestTask.execute(NodeTestTask.java:95)
[2025-06-12T06:25:12.790Z] at org.junit.platform.engine.support.hierarchical.SameThreadHierarchicalTestExecutorService.submit(SameThreadHierarchicalTestExecutorService.java:35)
[2025-06-12T06:25:12.790Z] at org.junit.platform.engine.support.hierarchical.HierarchicalTestExecutor.execute(HierarchicalTestExecutor.java:57)
[2025-06-12T06:25:12.790Z] at org.junit.platform.engine.support.hierarchical.HierarchicalTestEngine.execute(HierarchicalTestEngine.java:54)
[2025-06-12T06:25:12.790Z] at org.junit.platform.launcher.core.EngineExecutionOrchestrator.execute(EngineExecutionOrchestrator.java:147)
[2025-06-12T06:25:12.790Z] at org.junit.platform.launcher.core.EngineExecutionOrchestrator.execute(EngineExecutionOrchestrator.java:127)
[2025-06-12T06:25:12.790Z] at org.junit.platform.launcher.core.EngineExecutionOrchestrator.execute(EngineExecutionOrchestrator.java:90)
[2025-06-12T06:25:12.790Z] at org.junit.platform.launcher.core.EngineExecutionOrchestrator.lambda$execute$0(EngineExecutionOrchestrator.java:55)
[2025-06-12T06:25:12.790Z] at org.junit.platform.launcher.core.EngineExecutionOrchestrator.withInterceptedStreams(EngineExecutionOrchestrator.java:102)
[2025-06-12T06:25:12.790Z] at org.junit.platform.launcher.core.EngineExecutionOrchestrator.execute(EngineExecutionOrchestrator.java:54)
[2025-06-12T06:25:12.790Z] at org.junit.platform.launcher.core.DefaultLauncher.execute(DefaultLauncher.java:114)
[2025-06-12T06:25:12.790Z] at org.junit.platform.launcher.core.DefaultLauncher.execute(DefaultLauncher.java:86)
[2025-06-12T06:25:12.790Z] at org.junit.platform.launcher.core.DefaultLauncherSession$DelegatingLauncher.execute(DefaultLauncherSession.java:86)
[2025-06-12T06:25:12.790Z] at com.sun.javatest.regtest.agent.JUnitRunner.runWithJUnitPlatform(JUnitRunner.java:142)
[2025-06-12T06:25:12.790Z] at com.sun.javatest.regtest.agent.JUnitRunner.main(JUnitRunner.java:95)
[2025-06-12T06:25:12.790Z] at com.sun.javatest.regtest.agent.JUnitRunner.main(JUnitRunner.java:61)
[2025-06-12T06:25:12.790Z] at java.base/jdk.internal.reflect.NativeMethodAccessorImpl.invoke0(Native Method)
[2025-06-12T06:25:12.790Z] at java.base/jdk.internal.reflect.NativeMethodAccessorImpl.invoke(NativeMethodAccessorImpl.java:62)
[2025-06-12T06:25:12.790Z] at java.base/jdk.internal.reflect.DelegatingMethodAccessorImpl.invoke(DelegatingMethodAccessorImpl.java:43)
[2025-06-12T06:25:12.790Z] at java.base/java.lang.reflect.Method.invoke(Method.java:566)
[2025-06-12T06:25:12.790Z] at com.sun.javatest.regtest.agent.MainWrapper$MainTask.run(MainWrapper.java:138)
[2025-06-12T06:25:12.790Z] at java.base/java.lang.Thread.run(Thread.java:829)
[2025-06-12T06:25:12.790Z] Caused by: java.net.ConnectException: Connection refused
[2025-06-12T06:25:12.790Z] at java.base/sun.nio.ch.SocketChannelImpl.checkConnect(Native Method)
[2025-06-12T06:25:12.790Z] at java.base/sun.nio.ch.SocketChannelImpl.finishConnect(SocketChannelImpl.java:777)
[2025-06-12T06:25:12.790Z] at java.net.http/jdk.internal.net.http.PlainHttpConnection$ConnectEvent.handle(PlainHttpConnection.java:128)
[2025-06-12T06:25:12.790Z] at java.net.http/jdk.internal.net.http.HttpClientImpl$SelectorManager.handleEvent(HttpClientImpl.java:962)
[2025-06-12T06:25:12.790Z] at java.net.http/jdk.internal.net.http.HttpClientImpl$SelectorManager.lambda$run$3(HttpClientImpl.java:917)
[2025-06-12T06:25:12.790Z] at java.base/java.util.ArrayList.forEach(ArrayList.java:1541)
[2025-06-12T06:25:12.790Z] at java.net.http/jdk.internal.net.http.HttpClientImpl$SelectorManager.run(HttpClientImpl.java:917)
[2025-06-12T06:25:12.790Z] FAILED ConnectionReuseTest::testConnReuse '[1] https://localhost:58595/'
[2025-06-12T06:25:12.790Z] STARTED ConnectionReuseTest::testConnReuse '[2] http://localhost:43417/'
[2025-06-12T06:25:12.790Z] java.net.ConnectException: Connection refused
[2025-06-12T06:25:12.790Z] at java.net.http/jdk.internal.net.http.HttpClientImpl.send(HttpClientImpl.java:562)
[2025-06-12T06:25:12.790Z] at java.net.http/jdk.internal.net.http.HttpClientFacade.send(HttpClientFacade.java:119)
[2025-06-12T06:25:12.790Z] at ConnectionReuseTest.testConnReuse(ConnectionReuseTest.java:147)
[2025-06-12T06:25:12.790Z] at java.base/jdk.internal.reflect.NativeMethodAccessorImpl.invoke0(Native Method)
[2025-06-12T06:25:12.790Z] at java.base/jdk.internal.reflect.NativeMethodAccessorImpl.invoke(NativeMethodAccessorImpl.java:62)
[2025-06-12T06:25:12.790Z] at java.base/jdk.internal.reflect.DelegatingMethodAccessorImpl.invoke(DelegatingMethodAccessorImpl.java:43)
[2025-06-12T06:25:12.790Z] at java.base/java.lang.reflect.Method.invoke(Method.java:566)
[2025-06-12T06:25:12.790Z] at org.junit.platform.commons.util.ReflectionUtils.invokeMethod(ReflectionUtils.java:727)
[2025-06-12T06:25:12.790Z] at org.junit.jupiter.engine.execution.MethodInvocation.proceed(MethodInvocation.java:60)
[2025-06-12T06:25:12.790Z] at org.junit.jupiter.engine.execution.InvocationInterceptorChain$ValidatingInvocation.proceed(InvocationInterceptorChain.java:131)
[2025-06-12T06:25:12.790Z] at org.junit.jupiter.engine.extension.TimeoutExtension.intercept(TimeoutExtension.java:156)
[2025-06-12T06:25:12.790Z] at org.junit.jupiter.engine.extension.TimeoutExtension.interceptTestableMethod(TimeoutExtension.java:147)
[2025-06-12T06:25:12.790Z] at org.junit.jupiter.engine.extension.TimeoutExtension.interceptTestTemplateMethod(TimeoutExtension.java:94)
[2025-06-12T06:25:12.790Z] at org.junit.jupiter.engine.execution.InterceptingExecutableInvoker$ReflectiveInterceptorCall.lambda$ofVoidMethod$0(InterceptingExecutableInvoker.java:103)
[2025-06-12T06:25:12.790Z] at org.junit.jupiter.engine.execution.InterceptingExecutableInvoker.lambda$invoke$0(InterceptingExecutableInvoker.java:93)
[2025-06-12T06:25:12.790Z] at org.junit.jupiter.engine.execution.InvocationInterceptorChain$InterceptedInvocation.proceed(InvocationInterceptorChain.java:106)
[2025-06-12T06:25:12.790Z] at org.junit.jupiter.engine.execution.InvocationInterceptorChain.proceed(InvocationInterceptorChain.java:64)
[2025-06-12T06:25:12.790Z] at org.junit.jupiter.engine.execution.InvocationInterceptorChain.chainAndInvoke(InvocationInterceptorChain.java:45)
[2025-06-12T06:25:12.790Z] at org.junit.jupiter.engine.execution.InvocationInterceptorChain.invoke(InvocationInterceptorChain.java:37)
[2025-06-12T06:25:12.790Z] at org.junit.jupiter.engine.execution.InterceptingExecutableInvoker.invoke(InterceptingExecutableInvoker.java:92)
[2025-06-12T06:25:12.790Z] at org.junit.jupiter.engine.execution.InterceptingExecutableInvoker.invoke(InterceptingExecutableInvoker.java:86)
[2025-06-12T06:25:12.790Z] at org.junit.jupiter.engine.descriptor.TestMethodTestDescriptor.lambda$invokeTestMethod$7(TestMethodTestDescriptor.java:217)
[2025-06-12T06:25:12.790Z] at org.junit.platform.engine.support.hierarchical.ThrowableCollector.execute(ThrowableCollector.java:73)
[2025-06-12T06:25:12.790Z] at org.junit.jupiter.engine.descriptor.TestMethodTestDescriptor.invokeTestMethod(TestMethodTestDescriptor.java:213)
[2025-06-12T06:25:12.790Z] at org.junit.jupiter.engine.descriptor.TestMethodTestDescriptor.execute(TestMethodTestDescriptor.java:138)
[2025-06-12T06:25:12.790Z] at org.junit.jupiter.engine.descriptor.TestMethodTestDescriptor.execute(TestMethodTestDescriptor.java:68)
[2025-06-12T06:25:12.790Z] at org.junit.platform.engine.support.hierarchical.NodeTestTask.lambda$executeRecursively$6(NodeTestTask.java:151)
[2025-06-12T06:25:12.790Z] at org.junit.platform.engine.support.hierarchical.ThrowableCollector.execute(ThrowableCollector.java:73)
[2025-06-12T06:25:12.790Z] at org.junit.platform.engine.support.hierarchical.NodeTestTask.lambda$executeRecursively$8(NodeTestTask.java:141)
[2025-06-12T06:25:12.790Z] at org.junit.platform.engine.support.hierarchical.Node.around(Node.java:137)
[2025-06-12T06:25:12.790Z] at org.junit.platform.engine.support.hierarchical.NodeTestTask.lambda$executeRecursively$9(NodeTestTask.java:139)
[2025-06-12T06:25:12.790Z] at org.junit.platform.engine.support.hierarchical.ThrowableCollector.execute(ThrowableCollector.java:73)
[2025-06-12T06:25:12.790Z] at org.junit.platform.engine.support.hierarchical.NodeTestTask.executeRecursively(NodeTestTask.java:138)
[2025-06-12T06:25:12.790Z] at org.junit.platform.engine.support.hierarchical.NodeTestTask.execute(NodeTestTask.java:95)
[2025-06-12T06:25:12.790Z] at org.junit.platform.engine.support.hierarchical.SameThreadHierarchicalTestExecutorService.submit(SameThreadHierarchicalTestExecutorService.java:35)
[2025-06-12T06:25:12.790Z] at org.junit.platform.engine.support.hierarchical.NodeTestTask$DefaultDynamicTestExecutor.execute(NodeTestTask.java:226)
[2025-06-12T06:25:12.790Z] at org.junit.platform.engine.support.hierarchical.NodeTestTask$DefaultDynamicTestExecutor.execute(NodeTestTask.java:204)
[2025-06-12T06:25:12.790Z] at org.junit.jupiter.engine.descriptor.TestTemplateTestDescriptor.execute(TestTemplateTestDescriptor.java:142)
[2025-06-12T06:25:12.790Z] at org.junit.jupiter.engine.descriptor.TestTemplateTestDescriptor.lambda$execute$2(TestTemplateTestDescriptor.java:110)
[2025-06-12T06:25:12.791Z] at java.base/java.util.stream.ForEachOps$ForEachOp$OfRef.accept(ForEachOps.java:183)
[2025-06-12T06:25:12.791Z] at java.base/java.util.stream.ReferencePipeline$3$1.accept(ReferencePipeline.java:195)
[2025-06-12T06:25:12.791Z] at java.base/java.util.stream.ReferencePipeline$2$1.accept(ReferencePipeline.java:177)
[2025-06-12T06:25:12.791Z] at java.base/java.util.stream.ReferencePipeline$3$1.accept(ReferencePipeline.java:195)
[2025-06-12T06:25:12.791Z] at java.base/java.util.stream.ForEachOps$ForEachOp$OfRef.accept(ForEachOps.java:183)
[2025-06-12T06:25:12.791Z] at java.base/java.util.stream.ReferencePipeline$3$1.accept(ReferencePipeline.java:195)
[2025-06-12T06:25:12.791Z] at java.base/java.util.stream.ReferencePipeline$3$1.accept(ReferencePipeline.java:195)
[2025-06-12T06:25:12.791Z] at java.base/java.util.stream.ReferencePipeline$3$1.accept(ReferencePipeline.java:195)
[2025-06-12T06:25:12.791Z] at java.base/java.util.stream.ForEachOps$ForEachOp$OfRef.accept(ForEachOps.java:183)
[2025-06-12T06:25:12.791Z] at java.base/java.util.stream.ReferencePipeline$3$1.accept(ReferencePipeline.java:195)
[2025-06-12T06:25:12.791Z] at java.base/java.util.ArrayList$ArrayListSpliterator.forEachRemaining(ArrayList.java:1655)
[2025-06-12T06:25:12.791Z] at java.base/java.util.stream.ReferencePipeline$Head.forEach(ReferencePipeline.java:658)
[2025-06-12T06:25:12.791Z] at java.base/java.util.stream.ReferencePipeline$7$1.accept(ReferencePipeline.java:274)
[2025-06-12T06:25:12.791Z] at java.base/java.util.stream.ReferencePipeline$3$1.accept(ReferencePipeline.java:195)
[2025-06-12T06:25:12.791Z] at java.base/java.util.stream.ReferencePipeline$3$1.accept(ReferencePipeline.java:195)
[2025-06-12T06:25:12.791Z] at java.base/java.util.Spliterators$ArraySpliterator.forEachRemaining(Spliterators.java:948)
[2025-06-12T06:25:12.791Z] at java.base/java.util.stream.AbstractPipeline.copyInto(AbstractPipeline.java:484)
[2025-06-12T06:25:12.791Z] at java.base/java.util.stream.AbstractPipeline.wrapAndCopyInto(AbstractPipeline.java:474)
[2025-06-12T06:25:12.791Z] at java.base/java.util.stream.ForEachOps$ForEachOp.evaluateSequential(ForEachOps.java:150)
[2025-06-12T06:25:12.791Z] at java.base/java.util.stream.ForEachOps$ForEachOp$OfRef.evaluateSequential(ForEachOps.java:173)
[2025-06-12T06:25:12.791Z] at java.base/java.util.stream.AbstractPipeline.evaluate(AbstractPipeline.java:234)
[2025-06-12T06:25:12.791Z] at java.base/java.util.stream.ReferencePipeline.forEach(ReferencePipeline.java:497)
[2025-06-12T06:25:12.791Z] at java.base/java.util.stream.ReferencePipeline$7$1.accept(ReferencePipeline.java:274)
[2025-06-12T06:25:12.791Z] at java.base/java.util.stream.ReferencePipeline$3$1.accept(ReferencePipeline.java:195)
[2025-06-12T06:25:12.791Z] at java.base/java.util.stream.ReferencePipeline$3$1.accept(ReferencePipeline.java:195)
[2025-06-12T06:25:12.791Z] at java.base/java.util.stream.ReferencePipeline$3$1.accept(ReferencePipeline.java:195)
[2025-06-12T06:25:12.791Z] at java.base/java.util.ArrayList$ArrayListSpliterator.forEachRemaining(ArrayList.java:1655)
[2025-06-12T06:25:12.791Z] at java.base/java.util.stream.AbstractPipeline.copyInto(AbstractPipeline.java:484)
[2025-06-12T06:25:12.791Z] at java.base/java.util.stream.AbstractPipeline.wrapAndCopyInto(AbstractPipeline.java:474)
[2025-06-12T06:25:12.791Z] at java.base/java.util.stream.ForEachOps$ForEachOp.evaluateSequential(ForEachOps.java:150)
[2025-06-12T06:25:12.791Z] at java.base/java.util.stream.ForEachOps$ForEachOp$OfRef.evaluateSequential(ForEachOps.java:173)
[2025-06-12T06:25:12.791Z] at java.base/java.util.stream.AbstractPipeline.evaluate(AbstractPipeline.java:234)
[2025-06-12T06:25:12.791Z] at java.base/java.util.stream.ReferencePipeline.forEach(ReferencePipeline.java:497)
[2025-06-12T06:25:12.791Z] at java.base/java.util.stream.ReferencePipeline$7$1.accept(ReferencePipeline.java:274)
[2025-06-12T06:25:12.791Z] at java.base/java.util.ArrayList$ArrayListSpliterator.forEachRemaining(ArrayList.java:1655)
[2025-06-12T06:25:12.791Z] at java.base/java.util.stream.AbstractPipeline.copyInto(AbstractPipeline.java:484)
[2025-06-12T06:25:12.791Z] at java.base/java.util.stream.AbstractPipeline.wrapAndCopyInto(AbstractPipeline.java:474)
[2025-06-12T06:25:12.791Z] at java.base/java.util.stream.ForEachOps$ForEachOp.evaluateSequential(ForEachOps.java:150)
[2025-06-12T06:25:12.791Z] at java.base/java.util.stream.ForEachOps$ForEachOp$OfRef.evaluateSequential(ForEachOps.java:173)
[2025-06-12T06:25:12.791Z] at java.base/java.util.stream.AbstractPipeline.evaluate(AbstractPipeline.java:234)
[2025-06-12T06:25:12.791Z] at java.base/java.util.stream.ReferencePipeline.forEach(ReferencePipeline.java:497)
[2025-06-12T06:25:12.791Z] at org.junit.jupiter.engine.descriptor.TestTemplateTestDescriptor.execute(TestTemplateTestDescriptor.java:110)
[2025-06-12T06:25:12.791Z] at org.junit.jupiter.engine.descriptor.TestTemplateTestDescriptor.execute(TestTemplateTestDescriptor.java:44)
[2025-06-12T06:25:12.791Z] at org.junit.platform.engine.support.hierarchical.NodeTestTask.lambda$executeRecursively$6(NodeTestTask.java:151)
[2025-06-12T06:25:12.791Z] at org.junit.platform.engine.support.hierarchical.ThrowableCollector.execute(ThrowableCollector.java:73)
[2025-06-12T06:25:12.791Z] at org.junit.platform.engine.support.hierarchical.NodeTestTask.lambda$executeRecursively$8(NodeTestTask.java:141)
[2025-06-12T06:25:12.791Z] at org.junit.platform.engine.support.hierarchical.Node.around(Node.java:137)
[2025-06-12T06:25:12.791Z] at org.junit.platform.engine.support.hierarchical.NodeTestTask.lambda$executeRecursively$9(NodeTestTask.java:139)
[2025-06-12T06:25:12.791Z] at org.junit.platform.engine.support.hierarchical.ThrowableCollector.execute(ThrowableCollector.java:73)
[2025-06-12T06:25:12.791Z] at org.junit.platform.engine.support.hierarchical.NodeTestTask.executeRecursively(NodeTestTask.java:138)
[2025-06-12T06:25:12.791Z] at org.junit.platform.engine.support.hierarchical.NodeTestTask.execute(NodeTestTask.java:95)
[2025-06-12T06:25:12.791Z] at java.base/java.util.ArrayList.forEach(ArrayList.java:1541)
[2025-06-12T06:25:12.791Z] at org.junit.platform.engine.support.hierarchical.SameThreadHierarchicalTestExecutorService.invokeAll(SameThreadHierarchicalTestExecutorService.java:41)
[2025-06-12T06:25:12.791Z] at org.junit.platform.engine.support.hierarchical.NodeTestTask.lambda$executeRecursively$6(NodeTestTask.java:155)
[2025-06-12T06:25:12.791Z] at org.junit.platform.engine.support.hierarchical.ThrowableCollector.execute(ThrowableCollector.java:73)
[2025-06-12T06:25:12.791Z] at org.junit.platform.engine.support.hierarchical.NodeTestTask.lambda$executeRecursively$8(NodeTestTask.java:141)
[2025-06-12T06:25:12.791Z] at org.junit.platform.engine.support.hierarchical.Node.around(Node.java:137)
[2025-06-12T06:25:12.791Z] at org.junit.platform.engine.support.hierarchical.NodeTestTask.lambda$executeRecursively$9(NodeTestTask.java:139)
[2025-06-12T06:25:12.791Z] at org.junit.platform.engine.support.hierarchical.ThrowableCollector.execute(ThrowableCollector.java:73)
[2025-06-12T06:25:12.791Z] at org.junit.platform.engine.support.hierarchical.NodeTestTask.executeRecursively(NodeTestTask.java:138)
[2025-06-12T06:25:12.791Z] at org.junit.platform.engine.support.hierarchical.NodeTestTask.execute(NodeTestTask.java:95)
[2025-06-12T06:25:12.791Z] at java.base/java.util.ArrayList.forEach(ArrayList.java:1541)
[2025-06-12T06:25:12.791Z] at org.junit.platform.engine.support.hierarchical.SameThreadHierarchicalTestExecutorService.invokeAll(SameThreadHierarchicalTestExecutorService.java:41)
[2025-06-12T06:25:12.791Z] at org.junit.platform.engine.support.hierarchical.NodeTestTask.lambda$executeRecursively$6(NodeTestTask.java:155)
[2025-06-12T06:25:12.791Z] at org.junit.platform.engine.support.hierarchical.ThrowableCollector.execute(ThrowableCollector.java:73)
[2025-06-12T06:25:12.791Z] at org.junit.platform.engine.support.hierarchical.NodeTestTask.lambda$executeRecursively$8(NodeTestTask.java:141)
[2025-06-12T06:25:12.791Z] at org.junit.platform.engine.support.hierarchical.Node.around(Node.java:137)
[2025-06-12T06:25:12.791Z] at org.junit.platform.engine.support.hierarchical.NodeTestTask.lambda$executeRecursively$9(NodeTestTask.java:139)
[2025-06-12T06:25:12.791Z] at org.junit.platform.engine.support.hierarchical.ThrowableCollector.execute(ThrowableCollector.java:73)
[2025-06-12T06:25:12.791Z] at org.junit.platform.engine.support.hierarchical.NodeTestTask.executeRecursively(NodeTestTask.java:138)
[2025-06-12T06:25:12.791Z] at org.junit.platform.engine.support.hierarchical.NodeTestTask.execute(NodeTestTask.java:95)
[2025-06-12T06:25:12.791Z] at org.junit.platform.engine.support.hierarchical.SameThreadHierarchicalTestExecutorService.submit(SameThreadHierarchicalTestExecutorService.java:35)
[2025-06-12T06:25:12.791Z] at org.junit.platform.engine.support.hierarchical.HierarchicalTestExecutor.execute(HierarchicalTestExecutor.java:57)
[2025-06-12T06:25:12.791Z] at org.junit.platform.engine.support.hierarchical.HierarchicalTestEngine.execute(HierarchicalTestEngine.java:54)
[2025-06-12T06:25:12.791Z] at org.junit.platform.launcher.core.EngineExecutionOrchestrator.execute(EngineExecutionOrchestrator.java:147)
[2025-06-12T06:25:12.791Z] at org.junit.platform.launcher.core.EngineExecutionOrchestrator.execute(EngineExecutionOrchestrator.java:127)
[2025-06-12T06:25:12.791Z] at org.junit.platform.launcher.core.EngineExecutionOrchestrator.execute(EngineExecutionOrchestrator.java:90)
[2025-06-12T06:25:12.791Z] at org.junit.platform.launcher.core.EngineExecutionOrchestrator.lambda$execute$0(EngineExecutionOrchestrator.java:55)
[2025-06-12T06:25:12.791Z] at org.junit.platform.launcher.core.EngineExecutionOrchestrator.withInterceptedStreams(EngineExecutionOrchestrator.java:102)
[2025-06-12T06:25:12.791Z] at org.junit.platform.launcher.core.EngineExecutionOrchestrator.execute(EngineExecutionOrchestrator.java:54)
[2025-06-12T06:25:12.791Z] at org.junit.platform.launcher.core.DefaultLauncher.execute(DefaultLauncher.java:114)
[2025-06-12T06:25:12.791Z] at org.junit.platform.launcher.core.DefaultLauncher.execute(DefaultLauncher.java:86)
[2025-06-12T06:25:12.791Z] at org.junit.platform.launcher.core.DefaultLauncherSession$DelegatingLauncher.execute(DefaultLauncherSession.java:86)
[2025-06-12T06:25:12.791Z] at com.sun.javatest.regtest.agent.JUnitRunner.runWithJUnitPlatform(JUnitRunner.java:142)
[2025-06-12T06:25:12.791Z] at com.sun.javatest.regtest.agent.JUnitRunner.main(JUnitRunner.java:95)
[2025-06-12T06:25:12.791Z] at com.sun.javatest.regtest.agent.JUnitRunner.main(JUnitRunner.java:61)
[2025-06-12T06:25:12.791Z] at java.base/jdk.internal.reflect.NativeMethodAccessorImpl.invoke0(Native Method)
[2025-06-12T06:25:12.791Z] at java.base/jdk.internal.reflect.NativeMethodAccessorImpl.invoke(NativeMethodAccessorImpl.java:62)
[2025-06-12T06:25:12.791Z] at java.base/jdk.internal.reflect.DelegatingMethodAccessorImpl.invoke(DelegatingMethodAccessorImpl.java:43)
[2025-06-12T06:25:12.791Z] at java.base/java.lang.reflect.Method.invoke(Method.java:566)
[2025-06-12T06:25:12.791Z] at com.sun.javatest.regtest.agent.MainWrapper$MainTask.run(MainWrapper.java:138)
[2025-06-12T06:25:12.791Z] at java.base/java.lang.Thread.run(Thread.java:829)
[2025-06-12T06:25:12.792Z] Caused by: java.net.ConnectException: Connection refused
[2025-06-12T06:25:12.792Z] at java.base/sun.nio.ch.SocketChannelImpl.checkConnect(Native Method)
[2025-06-12T06:25:12.792Z] at java.base/sun.nio.ch.SocketChannelImpl.finishConnect(SocketChannelImpl.java:777)
[2025-06-12T06:25:12.792Z] at java.net.http/jdk.internal.net.http.PlainHttpConnection$ConnectEvent.handle(PlainHttpConnection.java:128)
[2025-06-12T06:25:12.792Z] at java.net.http/jdk.internal.net.http.HttpClientImpl$SelectorManager.handleEvent(HttpClientImpl.java:962)
[2025-06-12T06:25:12.792Z] at java.net.http/jdk.internal.net.http.HttpClientImpl$SelectorManager.lambda$run$3(HttpClientImpl.java:917)
[2025-06-12T06:25:12.792Z] at java.base/java.util.ArrayList.forEach(ArrayList.java:1541)
[2025-06-12T06:25:12.792Z] at java.net.http/jdk.internal.net.http.HttpClientImpl$SelectorManager.run(HttpClientImpl.java:917)
[2025-06-12T06:25:12.792Z] FAILED ConnectionReuseTest::testConnReuse '[2] http://localhost:43417/'
[2025-06-12T06:25:12.792Z] STARTED ConnectionReuseTest::testConnReuse '[3] http://[::1]:43417/'
[2025-06-12T06:25:12.792Z] TestServer: New connection from Socket[addr=/0:0:0:0:0:0:0:1,port=37930,localport=43417]
[2025-06-12T06:25:12.792Z] TestServer: GET /
[2025-06-12T06:25:12.792Z] Server: creating input stream for stream 1
[2025-06-12T06:25:12.792Z] Using handler for: /
[2025-06-12T06:25:12.792Z] Sent response headers 200
[2025-06-12T06:25:12.792Z] TestServer: GET /
[2025-06-12T06:25:12.792Z] Server: got END_STREAM for stream 3
[2025-06-12T06:25:12.792Z] Using handler for: /
[2025-06-12T06:25:12.792Z] Sent response headers 200
[2025-06-12T06:25:12.792Z] TestServer: GET /
[2025-06-12T06:25:12.792Z] Server: got END_STREAM for stream 5
[2025-06-12T06:25:12.792Z] Using handler for: /
[2025-06-12T06:25:12.792Z] Sent response headers 200
[2025-06-12T06:25:12.792Z] TestServer: GET /
[2025-06-12T06:25:12.792Z] Server: got END_STREAM for stream 7
[2025-06-12T06:25:12.792Z] Using handler for: /
[2025-06-12T06:25:12.792Z] Sent response headers 200
[2025-06-12T06:25:12.792Z] TestServer: GET /
[2025-06-12T06:25:12.792Z] Server: got END_STREAM for stream 9
[2025-06-12T06:25:12.792Z] Using handler for: /
[2025-06-12T06:25:12.792Z] Sent response headers 200
[2025-06-12T06:25:12.792Z] SUCCESSFUL ConnectionReuseTest::testConnReuse '[3] http://[::1]:43417/'
[2025-06-12T06:25:12.792Z] Server stopping 0 connections
[2025-06-12T06:25:12.792Z] Server stopping 1 connections
[2025-06-12T06:25:12.792Z] Server connection to /0:0:0:0:0:0:0:1:37930 stopping. 5 streams
[2025-06-12T06:25:12.792Z] TestServer: Connection writer stopping
[2025-06-12T06:25:12.792Z] JavaTest Message: JUnit Platform Failure(s): 2
[2025-06-12T06:25:12.792Z]
[2025-06-12T06:25:12.792Z] [ JUnit Containers: found 5, started 5, succeeded 5, failed 0, aborted 0, skipped 0]
[2025-06-12T06:25:12.792Z] [ JUnit Tests: found 3, started 3, succeeded 1, failed 2, aborted 0, skipped 0]
[2025-06-12T06:25:12.792Z]
[2025-06-12T06:25:12.792Z] java.lang.Exception: JUnit test failure
[2025-06-12T06:25:12.792Z] at com.sun.javatest.regtest.agent.JUnitRunner.runWithJUnitPlatform(JUnitRunner.java:149)
[2025-06-12T06:25:12.792Z] at com.sun.javatest.regtest.agent.JUnitRunner.main(JUnitRunner.java:95)
[2025-06-12T06:25:12.792Z] at com.sun.javatest.regtest.agent.JUnitRunner.main(JUnitRunner.java:61)
[2025-06-12T06:25:12.792Z] at java.base/jdk.internal.reflect.NativeMethodAccessorImpl.invoke0(Native Method)
[2025-06-12T06:25:12.792Z] at java.base/jdk.internal.reflect.NativeMethodAccessorImpl.invoke(NativeMethodAccessorImpl.java:62)
[2025-06-12T06:25:12.792Z] at java.base/jdk.internal.reflect.DelegatingMethodAccessorImpl.invoke(DelegatingMethodAccessorImpl.java:43)
[2025-06-12T06:25:12.792Z] at java.base/java.lang.reflect.Method.invoke(Method.java:566)
[2025-06-12T06:25:12.792Z] at com.sun.javatest.regtest.agent.MainWrapper$MainTask.run(MainWrapper.java:138)
[2025-06-12T06:25:12.792Z] at java.base/java.lang.Thread.run(Thread.java:829)
[2025-06-12T06:25:12.792Z]
[2025-06-12T06:25:12.792Z] JavaTest Message: Test threw exception: java.lang.Exception: JUnit test failure
[2025-06-12T06:25:12.792Z] JavaTest Message: shutting down test
[2025-06-12T06:25:12.792Z]
[2025-06-12T06:25:12.792Z] STATUS:Failed.`main' threw exception: java.lang.Exception: JUnit test failure
[2025-06-12T06:25:12.792Z] rerun:
[2025-06-12T06:25:12.792Z] cd /home/jenkins/workspace/Test_openjdk11_hs_extended.openjdk_x86-64_linux_testList_5/aqa-tests/TKG/output_17497093859969/jdk_net_1/work/scratch/0 && \
[2025-06-12T06:25:12.792Z] DISPLAY=:0 \
[2025-06-12T06:25:12.792Z] HOME=/home/jenkins \
[2025-06-12T06:25:12.792Z] LANG=en_US.UTF-8 \
[2025-06-12T06:25:12.792Z] PATH=/bin:/usr/bin:/usr/sbin \
[2025-06-12T06:25:12.792Z] XDG_RUNTIME_DIR=/run/user/1000 \
[2025-06-12T06:25:12.792Z] XDG_SESSION_ID=6533 \
[2025-06-12T06:25:12.792Z] CLASSPATH=/home/jenkins/workspace/Test_openjdk11_hs_extended.openjdk_x86-64_linux_testList_5/aqa-tests/TKG/output_17497093859969/jdk_net_1/work/classes/0/java/net/httpclient/http2/ConnectionReuseTest.d:/home/jenkins/workspace/Test_openjdk11_hs_extended.openjdk_x86-64_linux_testList_5/aqa-tests/openjdk/openjdk-jdk/test/jdk/java/net/httpclient/http2:/home/jenkins/workspace/Test_openjdk11_hs_extended.openjdk_x86-64_linux_testList_5/aqa-tests/TKG/output_17497093859969/jdk_net_1/work/classes/0/test/lib:/home/jenkins/workspace/Test_openjdk11_hs_extended.openjdk_x86-64_linux_testList_5/aqa-tests/openjdk/openjdk-jdk/test/lib:/home/jenkins/workspace/Test_openjdk11_hs_extended.openjdk_x86-64_linux_testList_5/aqa-tests/TKG/output_17497093859969/jdk_net_1/work/classes/0/java/net/httpclient/http2/server:/home/jenkins/workspace/Test_openjdk11_hs_extended.openjdk_x86-64_linux_testList_5/aqa-tests/openjdk/openjdk-jdk/test/jdk/java/net/httpclient/http2/server:/home/jenkins/workspace/Test_openjdk11_hs_extended.openjdk_x86-64_linux_testList_5/aqa-tests/TKG/output_17497093859969/jdk_net_1/work/classes/0/java/net/httpclient:/home/jenkins/workspace/Test_openjdk11_hs_extended.openjdk_x86-64_linux_testList_5/aqa-tests/openjdk/openjdk-jdk/test/jdk/java/net/httpclient:/home/jenkins/workspace/Test_openjdk11_hs_extended.openjdk_x86-64_linux_testList_5/jvmtest/openjdk/jtreg/lib/junit-platform-console-standalone-1.9.2.jar:/home/jenkins/workspace/Test_openjdk11_hs_extended.openjdk_x86-64_linux_testList_5/jvmtest/openjdk/jtreg/lib/javatest.jar:/home/jenkins/workspace/Test_openjdk11_hs_extended.openjdk_x86-64_linux_testList_5/jvmtest/openjdk/jtreg/lib/jtreg.jar \
[2025-06-12T06:25:12.792Z] /home/jenkins/workspace/Test_openjdk11_hs_extended.openjdk_x86-64_linux_testList_5/jdkbinary/j2sdk-image/bin/java \
[2025-06-12T06:25:12.792Z] -Dtest.vm.opts='-ea -esa -Xmx512m -XX:-UseCompressedOops' \
[2025-06-12T06:25:12.792Z] -Dtest.tool.vm.opts='-J-ea -J-esa -J-Xmx512m -J-XX:-UseCompressedOops' \
[2025-06-12T06:25:12.792Z] -Dtest.compiler.opts= \
[2025-06-12T06:25:12.792Z] -Dtest.java.opts= \
[2025-06-12T06:25:12.792Z] -Dtest.jdk=/home/jenkins/workspace/Test_openjdk11_hs_extended.openjdk_x86-64_linux_testList_5/jdkbinary/j2sdk-image \
[2025-06-12T06:25:12.792Z] -Dcompile.jdk=/home/jenkins/workspace/Test_openjdk11_hs_extended.openjdk_x86-64_linux_testList_5/jdkbinary/j2sdk-image \
[2025-06-12T06:25:12.792Z] -Dtest.timeout.factor=8.0 \
[2025-06-12T06:25:12.792Z] -Dtest.nativepath=/home/jenkins/workspace/Test_openjdk11_hs_extended.openjdk_x86-64_linux_testList_5/jdkbinary/openjdk-test-image/jdk/jtreg/native \
[2025-06-12T06:25:12.792Z] -Dtest.root=/home/jenkins/workspace/Test_openjdk11_hs_extended.openjdk_x86-64_linux_testList_5/aqa-tests/openjdk/openjdk-jdk/test/jdk \
[2025-06-12T06:25:12.792Z] -Dtest.name=java/net/httpclient/http2/ConnectionReuseTest.java \
[2025-06-12T06:25:12.792Z] -Dtest.file=/home/jenkins/workspace/Test_openjdk11_hs_extended.openjdk_x86-64_linux_testList_5/aqa-tests/openjdk/openjdk-jdk/test/jdk/java/net/httpclient/http2/ConnectionReuseTest.java \
[2025-06-12T06:25:12.792Z] -Dtest.src=/home/jenkins/workspace/Test_openjdk11_hs_extended.openjdk_x86-64_linux_testList_5/aqa-tests/openjdk/openjdk-jdk/test/jdk/java/net/httpclient/http2 \
[2025-06-12T06:25:12.792Z] -Dtest.src.path=/home/jenkins/workspace/Test_openjdk11_hs_extended.openjdk_x86-64_linux_testList_5/aqa-tests/openjdk/openjdk-jdk/test/jdk/java/net/httpclient/http2:/home/jenkins/workspace/Test_openjdk11_hs_extended.openjdk_x86-64_linux_testList_5/aqa-tests/openjdk/openjdk-jdk/test/lib:/home/jenkins/workspace/Test_openjdk11_hs_extended.openjdk_x86-64_linux_testList_5/aqa-tests/openjdk/openjdk-jdk/test/jdk/java/net/httpclient/http2/server:/home/jenkins/workspace/Test_openjdk11_hs_extended.openjdk_x86-64_linux_testList_5/aqa-tests/openjdk/openjdk-jdk/test/jdk/java/net/httpclient \
[2025-06-12T06:25:12.792Z] -Dtest.classes=/home/jenkins/workspace/Test_openjdk11_hs_extended.openjdk_x86-64_linux_testList_5/aqa-tests/TKG/output_17497093859969/jdk_net_1/work/classes/0/java/net/httpclient/http2/ConnectionReuseTest.d \
[2025-06-12T06:25:12.792Z] -Dtest.class.path=/home/jenkins/workspace/Test_openjdk11_hs_extended.openjdk_x86-64_linux_testList_5/aqa-tests/TKG/output_17497093859969/jdk_net_1/work/classes/0/java/net/httpclient/http2/ConnectionReuseTest.d:/home/jenkins/workspace/Test_openjdk11_hs_extended.openjdk_x86-64_linux_testList_5/aqa-tests/TKG/output_17497093859969/jdk_net_1/work/classes/0/test/lib:/home/jenkins/workspace/Test_openjdk11_hs_extended.openjdk_x86-64_linux_testList_5/aqa-tests/TKG/output_17497093859969/jdk_net_1/work/classes/0/java/net/httpclient/http2/server:/home/jenkins/workspace/Test_openjdk11_hs_extended.openjdk_x86-64_linux_testList_5/aqa-tests/TKG/output_17497093859969/jdk_net_1/work/classes/0/java/net/httpclient \
[2025-06-12T06:25:12.792Z] -Dtest.class.path.prefix=/home/jenkins/workspace/Test_openjdk11_hs_extended.openjdk_x86-64_linux_testList_5/aqa-tests/TKG/output_17497093859969/jdk_net_1/work/classes/0/java/net/httpclient/http2/ConnectionReuseTest.d:/home/jenkins/workspace/Test_openjdk11_hs_extended.openjdk_x86-64_linux_testList_5/aqa-tests/openjdk/openjdk-jdk/test/jdk/java/net/httpclient/http2:/home/jenkins/workspace/Test_openjdk11_hs_extended.openjdk_x86-64_linux_testList_5/aqa-tests/TKG/output_17497093859969/jdk_net_1/work/classes/0/test/lib:/home/jenkins/workspace/Test_openjdk11_hs_extended.openjdk_x86-64_linux_testList_5/aqa-tests/TKG/output_17497093859969/jdk_net_1/work/classes/0/java/net/httpclient/http2/server:/home/jenkins/workspace/Test_openjdk11_hs_extended.openjdk_x86-64_linux_testList_5/aqa-tests/TKG/output_17497093859969/jdk_net_1/work/classes/0/java/net/httpclient \
[2025-06-12T06:25:12.792Z] -Dtest.modules='java.net.http/jdk.internal.net.http.common java.net.http/jdk.internal.net.http.frame java.net.http/jdk.internal.net.http.hpack java.logging java.base/sun.net.www.http java.base/sun.net.www java.base/sun.net' \
[2025-06-12T06:25:12.792Z] --add-modules java.net.http,java.logging,java.base \
[2025-06-12T06:25:12.792Z] --add-exports java.net.http/jdk.internal.net.http.common=ALL-UNNAMED \
[2025-06-12T06:25:12.792Z] --add-exports java.net.http/jdk.internal.net.http.frame=ALL-UNNAMED \
[2025-06-12T06:25:12.792Z] --add-exports java.net.http/jdk.internal.net.http.hpack=ALL-UNNAMED \
[2025-06-12T06:25:12.792Z] --add-exports java.base/sun.net.www.http=ALL-UNNAMED \
[2025-06-12T06:25:12.792Z] --add-exports java.base/sun.net.www=ALL-UNNAMED \
[2025-06-12T06:25:12.793Z] --add-exports java.base/sun.net=ALL-UNNAMED \
[2025-06-12T06:25:12.793Z] -ea \
[2025-06-12T06:25:12.793Z] -esa \
[2025-06-12T06:25:12.793Z] -Xmx512m \
[2025-06-12T06:25:12.793Z] -XX:-UseCompressedOops \
[2025-06-12T06:25:12.793Z] -Djava.library.path=/home/jenkins/workspace/Test_openjdk11_hs_extended.openjdk_x86-64_linux_testList_5/jdkbinary/openjdk-test-image/jdk/jtreg/native \
[2025-06-12T06:25:12.793Z] -Djava.net.preferIPv6Addresses=true \
[2025-06-12T06:25:12.793Z] com.sun.javatest.regtest.agent.MainWrapper /home/jenkins/workspace/Test_openjdk11_hs_extended.openjdk_x86-64_linux_testList_5/aqa-tests/TKG/output_17497093859969/jdk_net_1/work/java/net/httpclient/http2/ConnectionReuseTest.d/junit.1.jta java/net/httpclient/http2/ConnectionReuseTest.java ConnectionReuseTest
[2025-06-12T06:25:12.793Z]
[2025-06-12T06:25:12.793Z] TEST RESULT: Failed. Execution failed: `main' threw exception: java.lang.Exception: JUnit test failure
[2025-06-12T06:25:12.793Z] --------------------------------------------------
[2025-06-12T06:51:56.096Z] Test results: passed: 723; failed: 1
[2025-06-12T06:51:57.490Z] Report written to /home/jenkins/workspace/Test_openjdk11_hs_extended.openjdk_x86-64_linux_testList_5/aqa-tests/TKG/output_17497093859969/jdk_net_1/report/html/report.html
[2025-06-12T06:51:57.490Z] Results written to /home/jenkins/workspace/Test_openjdk11_hs_extended.openjdk_x86-64_linux_testList_5/aqa-tests/TKG/output_17497093859969/jdk_net_1/work
[2025-06-12T06:51:57.490Z] Error: Some tests failed or other problems occurred.
[2025-06-12T06:51:57.490Z] -----------------------------------
[2025-06-12T06:51:57.490Z] jdk_net_1_FAILED
[2025-06-12T06:51:57.490Z] -----------------------------------
[2025-06-12T06:51:57.490Z]
[2025-06-12T06:51:57.490Z] TEST TEARDOWN:
[2025-06-12T06:51:57.490Z] Nothing to be done for teardown.
[2025-06-12T06:51:57.490Z] jdk_net_1 Finish Time: Thu Jun 12 06:51:56 2025 Epoch Time (ms): 1749711116316