Post Test
[2025-08-02T04:22:39.339Z] make[4]: Leaving directory '/cygdrive/c/jenkins/workspace/Test_openjdk11_hs_extended.perf_x86-32_windows/aqa-tests/perf/renaissance'
[2025-08-02T04:22:39.339Z] make[3]: Leaving directory '/cygdrive/c/jenkins/workspace/Test_openjdk11_hs_extended.perf_x86-32_windows/aqa-tests/perf'
[2025-08-02T04:22:39.339Z] make[2]: Leaving directory '/cygdrive/c/jenkins/workspace/Test_openjdk11_hs_extended.perf_x86-32_windows/aqa-tests'
[2025-08-02T04:22:39.339Z]
[2025-08-02T04:22:39.339Z]
[2025-08-02T04:22:39.339Z] All tests finished, run result summary:
[2025-08-02T04:22:39.339Z] cd "C:/jenkins/workspace/Test_openjdk11_hs_extended.perf_x86-32_windows/aqa-tests/\\TKG\\scripts"; \
[2025-08-02T04:22:39.340Z] perl "resultsSum.pl" --failuremk="C:/jenkins/workspace/Test_openjdk11_hs_extended.perf_x86-32_windows/aqa-tests/\\TKG\\failedtargets.mk" --resultFile="C:/jenkins/workspace/Test_openjdk11_hs_extended.perf_x86-32_windows/aqa-tests/\\TKG\\output_17541071399799\\TestTargetResult" --platFile="C:/jenkins/workspace/Test_openjdk11_hs_extended.perf_x86-32_windows/aqa-tests/\\TKG\\resources\\buildPlatformMap.properties" --diagnostic=failure --jdkVersion=11 --jdkImpl=hotspot --jdkVendor="eclipse" --spec=win_x86 --buildList=perf --customTarget="" --testTarget=extended.perf --tapPath=C:/jenkins/workspace/Test_openjdk11_hs_extended.perf_x86-32_windows/aqa-tests/\\TKG\\output_17541071399799\\ --tapName=Test_openjdk11_hs_extended.perf_x86-32_windows.tap --comment=""
[2025-08-02T04:22:39.651Z]
[2025-08-02T04:22:39.651Z]
[2025-08-02T04:22:39.651Z] TEST TARGETS SUMMARY
[2025-08-02T04:22:39.651Z] ++++++++++++++++++++++++++++++++++++++++++++++++++++++++++++++++++++++++++
[2025-08-02T04:22:39.651Z] DISABLED test targets:
[2025-08-02T04:22:39.651Z] renaissance-als_0
[2025-08-02T04:22:39.651Z] renaissance-chi-square_0
[2025-08-02T04:22:39.651Z] renaissance-dec-tree_0
[2025-08-02T04:22:39.651Z] renaissance-finagle-chirper_0
[2025-08-02T04:22:39.651Z] renaissance-gauss-mix_0
[2025-08-02T04:22:39.651Z] renaissance-log-regression_0
[2025-08-02T04:22:39.651Z] renaissance-movie-lens_0
[2025-08-02T04:22:39.651Z]
[2025-08-02T04:22:39.651Z] PASSED test targets:
[2025-08-02T04:22:39.651Z] dacapo-avrora_0
[2025-08-02T04:22:39.651Z] dacapo-fop_0
[2025-08-02T04:22:39.651Z] dacapo-jython_0
[2025-08-02T04:22:39.651Z] dacapo-luindex_0
[2025-08-02T04:22:39.651Z] dacapo-sunflow_0
[2025-08-02T04:22:39.651Z] dacapo-tomcat_0
[2025-08-02T04:22:39.651Z] dacapo-xalan_0
[2025-08-02T04:22:39.651Z] renaissance-db-shootout_0
[2025-08-02T04:22:39.651Z] renaissance-finagle-http_0
[2025-08-02T04:22:39.651Z] renaissance-mnemonics_0
[2025-08-02T04:22:39.651Z] renaissance-par-mnemonics_0
[2025-08-02T04:22:39.651Z] renaissance-philosophers_0
[2025-08-02T04:22:39.651Z]
[2025-08-02T04:22:39.651Z] FAILED test targets:
[2025-08-02T04:22:39.651Z] dacapo-pmd_0
[2025-08-02T04:22:39.651Z]
[2025-08-02T04:22:39.651Z] TOTAL: 20 EXECUTED: 13 PASSED: 12 FAILED: 1 DISABLED: 7 SKIPPED: 0
[2025-08-02T04:22:39.651Z] ++++++++++++++++++++++++++++++++++++++++++++++++++++++++++++++++++++++++++
[2025-08-02T04:22:39.651Z]
[2025-08-02T04:22:39.651Z] make[1]: *** [settings.mk:454: resultsSummary] Error 2
[2025-08-02T04:22:39.651Z] make[1]: Leaving directory '/cygdrive/c/jenkins/workspace/Test_openjdk11_hs_extended.perf_x86-32_windows/aqa-tests/TKG'
[2025-08-02T04:22:39.651Z] make: *** [makefile:62: _extended.perf] Error 2
[Pipeline] sh
[2025-08-02T04:22:40.174Z] ++ uname
[2025-08-02T04:22:40.174Z] + '[' CYGWIN_NT-10.0-20348 = AIX ']'
[2025-08-02T04:22:40.174Z] ++ uname
[2025-08-02T04:22:40.174Z] + '[' CYGWIN_NT-10.0-20348 = SunOS ']'
[2025-08-02T04:22:40.174Z] ++ uname
[2025-08-02T04:22:40.174Z] + '[' CYGWIN_NT-10.0-20348 = '*BSD' ']'
[2025-08-02T04:22:40.174Z] + MAKE=make
[2025-08-02T04:22:40.174Z] + make -f ./aqa-tests/TKG/testEnv.mk testEnvTeardown
[2025-08-02T04:22:40.487Z] make: Nothing to be done for 'testEnvTeardown'.
[Pipeline] }
[2025-08-02T04:22:40.538Z] $ ssh-agent -k
[2025-08-02T04:22:40.593Z] unset SSH_AUTH_SOCK;
[2025-08-02T04:22:40.593Z] unset SSH_AGENT_PID;
[2025-08-02T04:22:40.593Z] echo Agent pid 1267 killed;
[2025-08-02T04:22:40.647Z] [ssh-agent] Stopped.
[Pipeline] // sshagent
[Pipeline] echo
[2025-08-02T04:22:40.709Z] no DaCapo-h2 metric found
[Pipeline] echo
[2025-08-02T04:22:40.763Z] There were test failures, current build status is UNSTABLE.
[Pipeline] }
[Pipeline] // stage
[Pipeline] stage
[Pipeline] { (Post)
[Pipeline] echo
[2025-08-02T04:22:40.851Z] Saving aqa-tests/testenv/testenv.properties file on jenkins.
[Pipeline] archiveArtifacts
[2025-08-02T04:22:40.880Z] Archiving artifacts
[2025-08-02T04:22:40.931Z] Recording fingerprints
[Pipeline] echo
[2025-08-02T04:22:40.971Z] Saving aqa-tests/TKG/**/*.tap file on jenkins.
[Pipeline] archiveArtifacts
[2025-08-02T04:22:41.001Z] Archiving artifacts
[2025-08-02T04:22:41.098Z] Recording fingerprints
[Pipeline] sh
[2025-08-02T04:22:41.648Z] + tar -cf benchmark_test_output.tar.gz ./aqa-tests/TKG/output_17541071399799
[Pipeline] echo
[2025-08-02T04:22:42.004Z] ARTIFACTORY_SERVER is not set. Saving artifacts on jenkins.
[Pipeline] archiveArtifacts
[2025-08-02T04:22:42.035Z] Archiving artifacts
[2025-08-02T04:22:42.091Z] Recording fingerprints
[Pipeline] findFiles
[Pipeline] echo
[2025-08-02T04:22:43.725Z] Tap file found: aqa-tests\TKG\output_17541071399799\Test_openjdk11_hs_extended.perf_x86-32_windows.tap...
[Pipeline] readFile
[Pipeline] junit
[2025-08-02T04:22:43.853Z] Recording test results
[2025-08-02T04:22:44.936Z] None of the test reports contained any result
[2025-08-02T04:22:44.937Z] [Checks API] No suitable checks publisher found.
[Pipeline] }
[Pipeline] // stage
[Pipeline] echo
[2025-08-02T04:22:44.983Z] PROCESSCATCH: Terminating any hung/left over test processes:
[Pipeline] sh
[2025-08-02T04:22:45.455Z] + aqa-tests/terminateTestProcesses.sh null
[2025-08-02T04:22:45.455Z] Windows machine, using powershell queries...
[2025-08-02T04:22:44.904Z] No test report files were found. Configuration error?
[2025-08-02T04:22:47.056Z] Woohoo - no rogue processes detected!
[Pipeline] cleanWs
[2025-08-02T04:22:47.152Z] [WS-CLEANUP] Deleting project workspace...
[2025-08-02T04:22:47.152Z] [WS-CLEANUP] Deferred wipeout is disabled by the job configuration...
[2025-08-02T04:22:55.336Z] [WS-CLEANUP] done
[Pipeline] sh
[2025-08-02T04:22:55.824Z] + find /cygdrive/c/temp -name '*core*' -print -exec rm -f '{}' ';'
[Pipeline] }
[Pipeline] // timeout
[Pipeline] timeout
[2025-08-02T04:22:55.900Z] Timeout set to expire in 5 min 0 sec
[Pipeline] {
[Pipeline] }
[Pipeline] // timeout
[Pipeline] }
[Pipeline] // node
[Pipeline] }
[Pipeline] // stage
[Pipeline] stage
[Pipeline] { (Rerun)
[Pipeline] echo
[2025-08-02T04:22:56.047Z] allocate a node for generating rerun job ...
[Pipeline] node
[2025-08-02T04:22:56.075Z] Running on test-docker-ubi9-s390x-1 in /home/jenkins/workspace/Test_openjdk11_hs_extended.perf_x86-32_windows
[Pipeline] {
[Pipeline] echo
[2025-08-02T04:22:56.090Z] Generating rerun Test_openjdk11_hs_extended.perf_x86-32_windows_rerun job for running failed test(s) ...
[Pipeline] parallel
[Pipeline] { (Branch: Test_openjdk11_hs_extended.perf_x86-32_windows_rerun)
[Pipeline] echo
[2025-08-02T04:22:56.118Z] GENERATE_JOBS is set to true, set test job Test_openjdk11_hs_extended.perf_x86-32_windows_rerun params for generating the job
[Pipeline] fileExists
[Pipeline] sh
[2025-08-02T04:22:57.657Z] + curl -Os https://raw.githubusercontent.com/adoptium/aqa-tests/master/buildenv/jenkins/testJobTemplate
[Pipeline] jobDsl
[2025-08-02T04:22:58.594Z] Processing DSL script testJobTemplate
[2025-08-02T04:26:00.301Z] LEVELS: [extended]
[2025-08-02T04:26:00.301Z] JDK_VERSIONS: [8]
[2025-08-02T04:26:00.301Z] GROUPS: [perf]
[2025-08-02T04:26:00.301Z] ARCH_OS_LIST: [x86-32_windows]
[2025-08-02T04:26:00.452Z] Added items:
[2025-08-02T04:26:00.452Z] GeneratedJob{name='Test_openjdk11_hs_extended.perf_x86-32_windows_rerun'}
[Pipeline] }
[Pipeline] // parallel
[Pipeline] }
[Pipeline] // node
[Pipeline] echo
[2025-08-02T04:26:02.214Z] Triggering rerun jobs in parallel ...
[Pipeline] parallel
[Pipeline] { (Branch: Test_openjdk11_hs_extended.perf_x86-32_windows_rerun)
[Pipeline] build
[2025-08-02T04:26:02.263Z] Scheduling project: Test_openjdk11_hs_extended.perf_x86-32_windows_rerun
[2025-08-02T04:26:12.280Z] Starting building: Test_openjdk11_hs_extended.perf_x86-32_windows_rerun #1
[2025-08-02T08:13:07.000Z] Build Test_openjdk11_hs_extended.perf_x86-32_windows_rerun #1 completed: UNSTABLE
[Pipeline] }
[Pipeline] // parallel
[Pipeline] node
[2025-08-02T08:13:07.071Z] Running on test-aws-rhel76-armv8-1 in /home/jenkins/workspace/Test_openjdk11_hs_extended.perf_x86-32_windows
[Pipeline] {
[Pipeline] cleanWs
[2025-08-02T08:13:07.166Z] [WS-CLEANUP] Deleting project workspace...
[2025-08-02T08:13:07.166Z] [WS-CLEANUP] Deferred wipeout is disabled by the job configuration...
[2025-08-02T08:13:07.200Z] [WS-CLEANUP] done
[Pipeline] echo
[2025-08-02T08:13:07.210Z] Test_openjdk11_hs_extended.perf_x86-32_windows_rerun #1 completed with status UNSTABLE
[Pipeline] timeout
[2025-08-02T08:13:07.231Z] Timeout set to expire in 1 hr 0 min
[Pipeline] {
[Pipeline] copyArtifacts
[2025-08-02T08:13:07.461Z] Copied 1 artifact from "Test_openjdk11_hs_extended.perf_x86-32_windows_rerun" build number 1
[Pipeline] }
[Pipeline] // timeout
[Pipeline] echo
[2025-08-02T08:13:07.499Z] Saving Test_openjdk11_hs_extended.perf_x86-32_windows_rerun/1/**/*.tap file on jenkins.
[Pipeline] archiveArtifacts
[2025-08-02T08:13:07.534Z] Archiving artifacts
[2025-08-02T08:13:07.604Z] Recording fingerprints
[Pipeline] findFiles
[Pipeline] echo
[2025-08-02T08:13:07.809Z] Tap file found: Test_openjdk11_hs_extended.perf_x86-32_windows_rerun/1/aqa-tests/TKG/output_17541223435777/Test_openjdk11_hs_extended.perf_x86-32_windows_rerun.tap...
[Pipeline] readFile
[Pipeline] echo
[2025-08-02T08:13:07.906Z] Rerun in Grinder with failed test targets: https://ci.adoptium.net/job/Grinder/parambuild/?SDK_RESOURCE=upstream&TARGET=testList+TESTLIST=dacapo-pmd_0&BASE_DOCKER_REGISTRY_CREDENTIAL_ID=&TEST_FLAG=&UPSTREAM_TEST_JOB_NAME=&DOCKER_REQUIRED=false&ACTIVE_NODE_TIMEOUT=5&VENDOR_TEST_DIRS=&EXTRA_DOCKER_ARGS=&TKG_OWNER_BRANCH=adoptium%3Amaster&OPENJ9_SYSTEMTEST_OWNER_BRANCH=eclipse%3Amaster&PLATFORM=x86-32_windows&GENERATE_JOBS=true&KEEP_REPORTDIR=false&PERSONAL_BUILD=false&DOCKER_REGISTRY_DIR=&RERUN_ITERATIONS=0&ADOPTOPENJDK_REPO=https%3A%2F%2Fgithub.com%2Fadoptium%2Faqa-tests.git&SETUP_JCK_RUN=false&DOCKER_REGISTRY_URL_CREDENTIAL_ID=&LABEL=&EXTRA_OPTIONS=&CUSTOMIZED_SDK_URL=&BUILD_IDENTIFIER=&JENKINS_KEY=&ADOPTOPENJDK_BRANCH=master&LIGHT_WEIGHT_CHECKOUT=false&USE_JRE=false&ARTIFACTORY_SERVER=&KEEP_WORKSPACE=false&USER_CREDENTIALS_ID=&JDK_VERSION=11&DOCKER_REGISTRY_URL=&ITERATIONS=1&VENDOR_TEST_REPOS=&JDK_REPO=https%3A%2F%2Fgithub.com%2Fadoptium%2Fjdk11u&JCK_GIT_BRANCH=master&OPENJ9_BRANCH=master&OPENJ9_SHA=&JCK_GIT_REPO=&VENDOR_TEST_BRANCHES=&UPSTREAM_JOB_NAME=build-scripts%2Fjobs%2Fjdk11u%2Fjdk11u-windows-x86-32-temurin&OPENJ9_REPO=https%3A%2F%2Fgithub.com%2Feclipse-openj9%2Fopenj9.git&CLOUD_PROVIDER=&CUSTOM_TARGET=&VENDOR_TEST_SHAS=&JDK_BRANCH=jdk-11.0.29%2B1_adopt&LABEL_ADDITION=&ARTIFACTORY_REPO=&ARTIFACTORY_ROOT_DIR=&UPSTREAM_TEST_JOB_NUMBER=&DOCKERIMAGE_TAG=&TEST_TIME=120&JDK_IMPL=hotspot&SSH_AGENT_CREDENTIAL=&AUTO_DETECT=true&SLACK_CHANNEL=aqavit-bot&DYNAMIC_COMPILE=false&RELATED_NODES=&ADOPTOPENJDK_SYSTEMTEST_OWNER_BRANCH=adoptium%3Amaster&APPLICATION_OPTIONS=&CUSTOMIZED_SDK_URL_CREDENTIAL_ID=eclipse_temurin_bot_email_and_token&ARCHIVE_TEST_RESULTS=false&NUM_MACHINES=&OPENJDK_SHA=&TRSS_URL=&RERUN_FAILURE=false&USE_TESTENV_PROPERTIES=false&BUILD_LIST=perf&ADDITIONAL_ARTIFACTS_REQUIRED=&UPSTREAM_JOB_NUMBER=396&STF_OWNER_BRANCH=adoptium%3Amaster&TIME_LIMIT=25&JVM_OPTIONS=&PARALLEL=None
[Pipeline] cleanWs
[2025-08-02T08:13:08.010Z] [WS-CLEANUP] Deleting project workspace...
[2025-08-02T08:13:08.010Z] [WS-CLEANUP] Deferred wipeout is disabled by the job configuration...
[2025-08-02T08:13:08.041Z] [WS-CLEANUP] done
[Pipeline] }
[Pipeline] // node
[Pipeline] echo
[2025-08-02T08:13:08.078Z] rerun trigger job rerun jobsstatus is UNSTABLE
[Pipeline] echo
[2025-08-02T08:13:08.081Z] current jbo status is null
[Pipeline] echo
[2025-08-02T08:13:08.089Z] after setting currentBuild.result is UNSTABLE
[Pipeline] }
[Pipeline] // stage
[Pipeline] echo
[2025-08-02T08:13:08.121Z] None paralle and after rerun job status is UNSTABLE
[Pipeline] }
[Pipeline] // timestamps
[Pipeline] End of Pipeline
Finished: UNSTABLE