jdk_net_1
[2025-08-01T22:27:44.244Z] Running test jdk_net_1 ...
[2025-08-01T22:27:44.244Z] ===============================================
[2025-08-01T22:27:44.244Z] jdk_net_1 Start Time: Fri Aug 1 22:27:44 2025 Epoch Time (ms): 1754087264021
[2025-08-01T22:27:44.244Z] variation: Mode650
[2025-08-01T22:27:44.244Z] JVM_OPTIONS: -XX:-UseCompressedOops
[2025-08-01T22:27:44.244Z] { \
[2025-08-01T22:27:44.244Z] echo ""; echo "TEST SETUP:"; \
[2025-08-01T22:27:44.244Z] echo "Nothing to be done for setup."; \
[2025-08-01T22:27:44.244Z] mkdir -p "/home/jenkins/workspace/Test_openjdk11_hs_extended.openjdk_s390x_linux_testList_2/aqa-tests/TKG/../TKG/output_1754086839279/jdk_net_1"; \
[2025-08-01T22:27:44.244Z] cd "/home/jenkins/workspace/Test_openjdk11_hs_extended.openjdk_s390x_linux_testList_2/aqa-tests/TKG/../TKG/output_1754086839279/jdk_net_1"; \
[2025-08-01T22:27:44.244Z] echo ""; echo "TESTING:"; \
[2025-08-01T22:27:44.244Z] "/home/jenkins/workspace/Test_openjdk11_hs_extended.openjdk_s390x_linux_testList_2/jdkbinary/j2sdk-image/bin/java" -Xmx512m -jar "/home/jenkins/workspace/Test_openjdk11_hs_extended.openjdk_s390x_linux_testList_2/aqa-tests/TKG/../../jvmtest/openjdk/jtreg/lib/jtreg.jar" \
[2025-08-01T22:27:44.244Z] -agentvm -a -ea -esa -v:fail,error,time,nopass -retain:fail,error,*.dmp,javacore.*,heapdump.*,*.trc -ignore:quiet -timeoutFactor:8 -xml:verify -concurrency:1 -nativepath:"/home/jenkins/workspace/Test_openjdk11_hs_extended.openjdk_s390x_linux_testList_2/jdkbinary/openjdk-test-image/jdk/jtreg/native" -vmoptions:"-Xmx512m -XX:-UseCompressedOops " \
[2025-08-01T22:27:44.244Z] -w ""/home/jenkins/workspace/Test_openjdk11_hs_extended.openjdk_s390x_linux_testList_2/aqa-tests/TKG/../TKG/output_1754086839279/jdk_net_1"/work" \
[2025-08-01T22:27:44.244Z] -r ""/home/jenkins/workspace/Test_openjdk11_hs_extended.openjdk_s390x_linux_testList_2/aqa-tests/TKG/../TKG/output_1754086839279/jdk_net_1"/report" \
[2025-08-01T22:27:44.244Z] -jdk:"/home/jenkins/workspace/Test_openjdk11_hs_extended.openjdk_s390x_linux_testList_2/jdkbinary/j2sdk-image" \
[2025-08-01T22:27:44.244Z] -exclude:"/home/jenkins/workspace/Test_openjdk11_hs_extended.openjdk_s390x_linux_testList_2/aqa-tests/TKG/../openjdk/openjdk-jdk/test/jdk/ProblemList.txt" \
[2025-08-01T22:27:44.244Z] -exclude:"/home/jenkins/workspace/Test_openjdk11_hs_extended.openjdk_s390x_linux_testList_2/aqa-tests/TKG/../../jvmtest/openjdk/excludes/ProblemList_openjdk11.txt" \
[2025-08-01T22:27:44.244Z] \
[2025-08-01T22:27:44.244Z] -exclude:"/home/jenkins/workspace/Test_openjdk11_hs_extended.openjdk_s390x_linux_testList_2/aqa-tests/TKG/../openjdk/excludes/vendors/eclipse/ProblemList_openjdk11.txt" \
[2025-08-01T22:27:44.244Z] "/home/jenkins/workspace/Test_openjdk11_hs_extended.openjdk_s390x_linux_testList_2/aqa-tests/TKG/../openjdk/openjdk-jdk/test/jdk:jdk_net"; \
[2025-08-01T22:27:44.244Z] if [ $? -eq 0 ]; then echo "-----------------------------------"; echo "jdk_net_1""_PASSED"; echo "-----------------------------------"; cd /home/jenkins/workspace/Test_openjdk11_hs_extended.openjdk_s390x_linux_testList_2/aqa-tests/TKG/..; else echo "-----------------------------------"; echo "jdk_net_1""_FAILED"; echo "-----------------------------------"; fi; \
[2025-08-01T22:27:44.244Z] echo ""; echo "TEST TEARDOWN:"; \
[2025-08-01T22:27:44.244Z] echo "Nothing to be done for teardown."; \
[2025-08-01T22:27:44.244Z] } 2>&1 | tee -a "/home/jenkins/workspace/Test_openjdk11_hs_extended.openjdk_s390x_linux_testList_2/aqa-tests/TKG/../TKG/output_1754086839279/TestTargetResult";
[2025-08-01T22:27:44.244Z]
[2025-08-01T22:27:44.244Z] TEST SETUP:
[2025-08-01T22:27:44.244Z] Nothing to be done for setup.
[2025-08-01T22:27:44.244Z]
[2025-08-01T22:27:44.244Z] TESTING:
[2025-08-01T22:27:45.642Z] Directory "/home/jenkins/workspace/Test_openjdk11_hs_extended.openjdk_s390x_linux_testList_2/aqa-tests/TKG/../TKG/output_1754086839279/jdk_net_1/work" not found: creating
[2025-08-01T22:27:45.642Z] Directory "/home/jenkins/workspace/Test_openjdk11_hs_extended.openjdk_s390x_linux_testList_2/aqa-tests/TKG/../TKG/output_1754086839279/jdk_net_1/report" not found: creating
[2025-08-01T22:27:50.631Z] XML output with verification to /home/jenkins/workspace/Test_openjdk11_hs_extended.openjdk_s390x_linux_testList_2/aqa-tests/TKG/output_1754086839279/jdk_net_1/work
[2025-08-01T22:33:43.893Z] --------------------------------------------------
[2025-08-01T22:33:43.893Z] TEST: java/net/httpclient/http2/ConnectionReuseTest.java
[2025-08-01T22:33:43.893Z] TEST JDK: /home/jenkins/workspace/Test_openjdk11_hs_extended.openjdk_s390x_linux_testList_2/jdkbinary/j2sdk-image
[2025-08-01T22:33:43.893Z]
[2025-08-01T22:33:43.893Z] ACTION: build -- Passed. Build successful
[2025-08-01T22:33:43.893Z] REASON: User specified action: run build jdk.test.lib.net.SimpleSSLContext HttpServerAdapters ReferenceTracker jdk.test.lib.net.IPSupport
[2025-08-01T22:33:43.893Z] TIME: 0.306 seconds
[2025-08-01T22:33:43.893Z] messages:
[2025-08-01T22:33:43.893Z] command: build jdk.test.lib.net.SimpleSSLContext HttpServerAdapters ReferenceTracker jdk.test.lib.net.IPSupport
[2025-08-01T22:33:43.893Z] reason: User specified action: run build jdk.test.lib.net.SimpleSSLContext HttpServerAdapters ReferenceTracker jdk.test.lib.net.IPSupport
[2025-08-01T22:33:43.893Z] started: Fri Aug 01 22:33:34 UTC 2025
[2025-08-01T22:33:43.893Z] Library ../:
[2025-08-01T22:33:43.893Z] compile: HttpServerAdapters, ReferenceTracker
[2025-08-01T22:33:43.893Z] Library /test/lib:
[2025-08-01T22:33:43.893Z] compile: jdk.test.lib.net.IPSupport
[2025-08-01T22:33:43.893Z] finished: Fri Aug 01 22:33:34 UTC 2025
[2025-08-01T22:33:43.893Z] elapsed time (seconds): 0.306
[2025-08-01T22:33:43.893Z]
[2025-08-01T22:33:43.893Z] ACTION: compile -- Passed. Compilation successful
[2025-08-01T22:33:43.893Z] REASON: .class file out of date or does not exist
[2025-08-01T22:33:43.893Z] TIME: 0.215 seconds
[2025-08-01T22:33:43.893Z] messages:
[2025-08-01T22:33:43.893Z] command: compile /home/jenkins/workspace/Test_openjdk11_hs_extended.openjdk_s390x_linux_testList_2/aqa-tests/openjdk/openjdk-jdk/test/jdk/java/net/httpclient/HttpServerAdapters.java /home/jenkins/workspace/Test_openjdk11_hs_extended.openjdk_s390x_linux_testList_2/aqa-tests/openjdk/openjdk-jdk/test/jdk/java/net/httpclient/ReferenceTracker.java
[2025-08-01T22:33:43.893Z] reason: .class file out of date or does not exist
[2025-08-01T22:33:43.893Z] started: Fri Aug 01 22:33:34 UTC 2025
[2025-08-01T22:33:43.893Z] Additional options from @modules: --add-modules java.net.http,java.logging,java.base --add-exports java.net.http/jdk.internal.net.http.common=ALL-UNNAMED --add-exports java.net.http/jdk.internal.net.http.frame=ALL-UNNAMED --add-exports java.net.http/jdk.internal.net.http.hpack=ALL-UNNAMED --add-exports java.base/sun.net.www.http=ALL-UNNAMED --add-exports java.base/sun.net.www=ALL-UNNAMED --add-exports java.base/sun.net=ALL-UNNAMED
[2025-08-01T22:33:43.893Z] Mode: agentvm
[2025-08-01T22:33:43.893Z] Agent id: 1
[2025-08-01T22:33:43.893Z] finished: Fri Aug 01 22:33:34 UTC 2025
[2025-08-01T22:33:43.893Z] elapsed time (seconds): 0.215
[2025-08-01T22:33:43.893Z] configuration:
[2025-08-01T22:33:43.893Z] Boot Layer (javac runtime environment)
[2025-08-01T22:33:43.893Z] class path: /home/jenkins/workspace/Test_openjdk11_hs_extended.openjdk_s390x_linux_testList_2/jvmtest/openjdk/jtreg/lib/javatest.jar
[2025-08-01T22:33:43.893Z] /home/jenkins/workspace/Test_openjdk11_hs_extended.openjdk_s390x_linux_testList_2/jvmtest/openjdk/jtreg/lib/jtreg.jar
[2025-08-01T22:33:43.893Z] patch: java.base /home/jenkins/workspace/Test_openjdk11_hs_extended.openjdk_s390x_linux_testList_2/aqa-tests/TKG/output_1754086839279/jdk_net_1/work/patches/java.base
[2025-08-01T22:33:43.893Z]
[2025-08-01T22:33:43.893Z] javac compilation environment
[2025-08-01T22:33:43.893Z] add modules: java.net.http java.logging java.base
[2025-08-01T22:33:43.893Z] add exports: java.base/sun.net ALL-UNNAMED
[2025-08-01T22:33:43.893Z] java.base/sun.net.www ALL-UNNAMED
[2025-08-01T22:33:43.893Z] java.base/sun.net.www.http ALL-UNNAMED
[2025-08-01T22:33:43.893Z] java.net.http/jdk.internal.net.http.common ALL-UNNAMED
[2025-08-01T22:33:43.893Z] java.net.http/jdk.internal.net.http.frame ALL-UNNAMED
[2025-08-01T22:33:43.893Z] java.net.http/jdk.internal.net.http.hpack ALL-UNNAMED
[2025-08-01T22:33:43.893Z] source path: /home/jenkins/workspace/Test_openjdk11_hs_extended.openjdk_s390x_linux_testList_2/aqa-tests/openjdk/openjdk-jdk/test/lib
[2025-08-01T22:33:43.893Z] /home/jenkins/workspace/Test_openjdk11_hs_extended.openjdk_s390x_linux_testList_2/aqa-tests/openjdk/openjdk-jdk/test/jdk/java/net/httpclient/http2/server
[2025-08-01T22:33:43.893Z] /home/jenkins/workspace/Test_openjdk11_hs_extended.openjdk_s390x_linux_testList_2/aqa-tests/openjdk/openjdk-jdk/test/jdk/java/net/httpclient
[2025-08-01T22:33:43.893Z] class path: /home/jenkins/workspace/Test_openjdk11_hs_extended.openjdk_s390x_linux_testList_2/aqa-tests/TKG/output_1754086839279/jdk_net_1/work/classes/test/lib
[2025-08-01T22:33:43.893Z] /home/jenkins/workspace/Test_openjdk11_hs_extended.openjdk_s390x_linux_testList_2/aqa-tests/TKG/output_1754086839279/jdk_net_1/work/classes/java/net/httpclient/http2/server
[2025-08-01T22:33:43.893Z] /home/jenkins/workspace/Test_openjdk11_hs_extended.openjdk_s390x_linux_testList_2/aqa-tests/TKG/output_1754086839279/jdk_net_1/work/classes/java/net/httpclient
[2025-08-01T22:33:43.893Z] /home/jenkins/workspace/Test_openjdk11_hs_extended.openjdk_s390x_linux_testList_2/jvmtest/openjdk/jtreg/lib/junit-platform-console-standalone-1.9.2.jar
[2025-08-01T22:33:43.893Z]
[2025-08-01T22:33:43.893Z] rerun:
[2025-08-01T22:33:43.893Z] cd /home/jenkins/workspace/Test_openjdk11_hs_extended.openjdk_s390x_linux_testList_2/aqa-tests/TKG/output_1754086839279/jdk_net_1/work/scratch && \
[2025-08-01T22:33:43.893Z] DBUS_SESSION_BUS_ADDRESS=unix:path=/run/user/1002/bus \
[2025-08-01T22:33:43.893Z] DISPLAY=:0 \
[2025-08-01T22:33:43.893Z] HOME=/home/jenkins \
[2025-08-01T22:33:43.893Z] LANG=C.UTF-8 \
[2025-08-01T22:33:43.893Z] PATH=/bin:/usr/bin:/usr/sbin \
[2025-08-01T22:33:43.893Z] XDG_RUNTIME_DIR=/run/user/1002 \
[2025-08-01T22:33:43.893Z] XDG_SESSION_CLASS=user \
[2025-08-01T22:33:43.893Z] XDG_SESSION_ID=1195 \
[2025-08-01T22:33:43.893Z] XDG_SESSION_TYPE=tty \
[2025-08-01T22:33:43.893Z] /home/jenkins/workspace/Test_openjdk11_hs_extended.openjdk_s390x_linux_testList_2/jdkbinary/j2sdk-image/bin/javac \
[2025-08-01T22:33:43.893Z] -J-ea \
[2025-08-01T22:33:43.893Z] -J-esa \
[2025-08-01T22:33:43.893Z] -J-Xmx512m \
[2025-08-01T22:33:43.893Z] -J-XX:-UseCompressedOops \
[2025-08-01T22:33:43.893Z] -J-Dtest.vm.opts='-ea -esa -Xmx512m -XX:-UseCompressedOops' \
[2025-08-01T22:33:43.893Z] -J-Dtest.tool.vm.opts='-J-ea -J-esa -J-Xmx512m -J-XX:-UseCompressedOops' \
[2025-08-01T22:33:43.893Z] -J-Dtest.compiler.opts= \
[2025-08-01T22:33:43.893Z] -J-Dtest.java.opts= \
[2025-08-01T22:33:43.893Z] -J-Dtest.jdk=/home/jenkins/workspace/Test_openjdk11_hs_extended.openjdk_s390x_linux_testList_2/jdkbinary/j2sdk-image \
[2025-08-01T22:33:43.893Z] -J-Dcompile.jdk=/home/jenkins/workspace/Test_openjdk11_hs_extended.openjdk_s390x_linux_testList_2/jdkbinary/j2sdk-image \
[2025-08-01T22:33:43.893Z] -J-Dtest.timeout.factor=8.0 \
[2025-08-01T22:33:43.893Z] -J-Dtest.nativepath=/home/jenkins/workspace/Test_openjdk11_hs_extended.openjdk_s390x_linux_testList_2/jdkbinary/openjdk-test-image/jdk/jtreg/native \
[2025-08-01T22:33:43.893Z] -J-Dtest.root=/home/jenkins/workspace/Test_openjdk11_hs_extended.openjdk_s390x_linux_testList_2/aqa-tests/openjdk/openjdk-jdk/test/jdk \
[2025-08-01T22:33:43.893Z] -J-Dtest.name=java/net/httpclient/http2/ConnectionReuseTest.java \
[2025-08-01T22:33:43.893Z] -J-Dtest.file=/home/jenkins/workspace/Test_openjdk11_hs_extended.openjdk_s390x_linux_testList_2/aqa-tests/openjdk/openjdk-jdk/test/jdk/java/net/httpclient/http2/ConnectionReuseTest.java \
[2025-08-01T22:33:43.893Z] -J-Dtest.src=/home/jenkins/workspace/Test_openjdk11_hs_extended.openjdk_s390x_linux_testList_2/aqa-tests/openjdk/openjdk-jdk/test/jdk/java/net/httpclient/http2 \
[2025-08-01T22:33:43.893Z] -J-Dtest.src.path=/home/jenkins/workspace/Test_openjdk11_hs_extended.openjdk_s390x_linux_testList_2/aqa-tests/openjdk/openjdk-jdk/test/jdk/java/net/httpclient/http2:/home/jenkins/workspace/Test_openjdk11_hs_extended.openjdk_s390x_linux_testList_2/aqa-tests/openjdk/openjdk-jdk/test/lib:/home/jenkins/workspace/Test_openjdk11_hs_extended.openjdk_s390x_linux_testList_2/aqa-tests/openjdk/openjdk-jdk/test/jdk/java/net/httpclient/http2/server:/home/jenkins/workspace/Test_openjdk11_hs_extended.openjdk_s390x_linux_testList_2/aqa-tests/openjdk/openjdk-jdk/test/jdk/java/net/httpclient \
[2025-08-01T22:33:43.893Z] -J-Dtest.classes=/home/jenkins/workspace/Test_openjdk11_hs_extended.openjdk_s390x_linux_testList_2/aqa-tests/TKG/output_1754086839279/jdk_net_1/work/classes/java/net/httpclient/http2/ConnectionReuseTest.d \
[2025-08-01T22:33:43.893Z] -J-Dtest.class.path=/home/jenkins/workspace/Test_openjdk11_hs_extended.openjdk_s390x_linux_testList_2/aqa-tests/TKG/output_1754086839279/jdk_net_1/work/classes/java/net/httpclient/http2/ConnectionReuseTest.d:/home/jenkins/workspace/Test_openjdk11_hs_extended.openjdk_s390x_linux_testList_2/aqa-tests/TKG/output_1754086839279/jdk_net_1/work/classes/test/lib:/home/jenkins/workspace/Test_openjdk11_hs_extended.openjdk_s390x_linux_testList_2/aqa-tests/TKG/output_1754086839279/jdk_net_1/work/classes/java/net/httpclient/http2/server:/home/jenkins/workspace/Test_openjdk11_hs_extended.openjdk_s390x_linux_testList_2/aqa-tests/TKG/output_1754086839279/jdk_net_1/work/classes/java/net/httpclient \
[2025-08-01T22:33:43.894Z] -J-Dtest.class.path.prefix=/home/jenkins/workspace/Test_openjdk11_hs_extended.openjdk_s390x_linux_testList_2/aqa-tests/openjdk/openjdk-jdk/test/jdk/java/net/httpclient/http2:/home/jenkins/workspace/Test_openjdk11_hs_extended.openjdk_s390x_linux_testList_2/aqa-tests/TKG/output_1754086839279/jdk_net_1/work/classes/test/lib:/home/jenkins/workspace/Test_openjdk11_hs_extended.openjdk_s390x_linux_testList_2/aqa-tests/TKG/output_1754086839279/jdk_net_1/work/classes/java/net/httpclient/http2/server:/home/jenkins/workspace/Test_openjdk11_hs_extended.openjdk_s390x_linux_testList_2/aqa-tests/TKG/output_1754086839279/jdk_net_1/work/classes/java/net/httpclient \
[2025-08-01T22:33:43.894Z] -J-Dtest.modules='java.net.http/jdk.internal.net.http.common java.net.http/jdk.internal.net.http.frame java.net.http/jdk.internal.net.http.hpack java.logging java.base/sun.net.www.http java.base/sun.net.www java.base/sun.net' \
[2025-08-01T22:33:43.894Z] --add-modules java.net.http,java.logging,java.base \
[2025-08-01T22:33:43.894Z] --add-exports java.net.http/jdk.internal.net.http.common=ALL-UNNAMED \
[2025-08-01T22:33:43.894Z] --add-exports java.net.http/jdk.internal.net.http.frame=ALL-UNNAMED \
[2025-08-01T22:33:43.894Z] --add-exports java.net.http/jdk.internal.net.http.hpack=ALL-UNNAMED \
[2025-08-01T22:33:43.894Z] --add-exports java.base/sun.net.www.http=ALL-UNNAMED \
[2025-08-01T22:33:43.894Z] --add-exports java.base/sun.net.www=ALL-UNNAMED \
[2025-08-01T22:33:43.894Z] --add-exports java.base/sun.net=ALL-UNNAMED \
[2025-08-01T22:33:43.894Z] -d /home/jenkins/workspace/Test_openjdk11_hs_extended.openjdk_s390x_linux_testList_2/aqa-tests/TKG/output_1754086839279/jdk_net_1/work/classes/java/net/httpclient \
[2025-08-01T22:33:43.894Z] -sourcepath /home/jenkins/workspace/Test_openjdk11_hs_extended.openjdk_s390x_linux_testList_2/aqa-tests/openjdk/openjdk-jdk/test/lib:/home/jenkins/workspace/Test_openjdk11_hs_extended.openjdk_s390x_linux_testList_2/aqa-tests/openjdk/openjdk-jdk/test/jdk/java/net/httpclient/http2/server:/home/jenkins/workspace/Test_openjdk11_hs_extended.openjdk_s390x_linux_testList_2/aqa-tests/openjdk/openjdk-jdk/test/jdk/java/net/httpclient \
[2025-08-01T22:33:43.894Z] -classpath /home/jenkins/workspace/Test_openjdk11_hs_extended.openjdk_s390x_linux_testList_2/aqa-tests/TKG/output_1754086839279/jdk_net_1/work/classes/test/lib:/home/jenkins/workspace/Test_openjdk11_hs_extended.openjdk_s390x_linux_testList_2/aqa-tests/TKG/output_1754086839279/jdk_net_1/work/classes/java/net/httpclient/http2/server:/home/jenkins/workspace/Test_openjdk11_hs_extended.openjdk_s390x_linux_testList_2/aqa-tests/TKG/output_1754086839279/jdk_net_1/work/classes/java/net/httpclient:/home/jenkins/workspace/Test_openjdk11_hs_extended.openjdk_s390x_linux_testList_2/jvmtest/openjdk/jtreg/lib/junit-platform-console-standalone-1.9.2.jar /home/jenkins/workspace/Test_openjdk11_hs_extended.openjdk_s390x_linux_testList_2/aqa-tests/openjdk/openjdk-jdk/test/jdk/java/net/httpclient/HttpServerAdapters.java /home/jenkins/workspace/Test_openjdk11_hs_extended.openjdk_s390x_linux_testList_2/aqa-tests/openjdk/openjdk-jdk/test/jdk/java/net/httpclient/ReferenceTracker.java
[2025-08-01T22:33:43.894Z]
[2025-08-01T22:33:43.894Z] ACTION: compile -- Passed. Compilation successful
[2025-08-01T22:33:43.894Z] REASON: .class file out of date or does not exist
[2025-08-01T22:33:43.894Z] TIME: 0.089 seconds
[2025-08-01T22:33:43.894Z] messages:
[2025-08-01T22:33:43.894Z] command: compile /home/jenkins/workspace/Test_openjdk11_hs_extended.openjdk_s390x_linux_testList_2/aqa-tests/openjdk/openjdk-jdk/test/lib/jdk/test/lib/net/IPSupport.java
[2025-08-01T22:33:43.894Z] reason: .class file out of date or does not exist
[2025-08-01T22:33:43.894Z] started: Fri Aug 01 22:33:34 UTC 2025
[2025-08-01T22:33:43.894Z] Additional options from @modules: --add-modules java.net.http,java.logging,java.base --add-exports java.net.http/jdk.internal.net.http.common=ALL-UNNAMED --add-exports java.net.http/jdk.internal.net.http.frame=ALL-UNNAMED --add-exports java.net.http/jdk.internal.net.http.hpack=ALL-UNNAMED --add-exports java.base/sun.net.www.http=ALL-UNNAMED --add-exports java.base/sun.net.www=ALL-UNNAMED --add-exports java.base/sun.net=ALL-UNNAMED
[2025-08-01T22:33:43.894Z] Mode: agentvm
[2025-08-01T22:33:43.894Z] Agent id: 1
[2025-08-01T22:33:43.894Z] finished: Fri Aug 01 22:33:34 UTC 2025
[2025-08-01T22:33:43.894Z] elapsed time (seconds): 0.089
[2025-08-01T22:33:43.894Z] configuration:
[2025-08-01T22:33:43.894Z] Boot Layer (javac runtime environment)
[2025-08-01T22:33:43.894Z] class path: /home/jenkins/workspace/Test_openjdk11_hs_extended.openjdk_s390x_linux_testList_2/jvmtest/openjdk/jtreg/lib/javatest.jar
[2025-08-01T22:33:43.894Z] /home/jenkins/workspace/Test_openjdk11_hs_extended.openjdk_s390x_linux_testList_2/jvmtest/openjdk/jtreg/lib/jtreg.jar
[2025-08-01T22:33:43.894Z] patch: java.base /home/jenkins/workspace/Test_openjdk11_hs_extended.openjdk_s390x_linux_testList_2/aqa-tests/TKG/output_1754086839279/jdk_net_1/work/patches/java.base
[2025-08-01T22:33:43.894Z]
[2025-08-01T22:33:43.894Z] javac compilation environment
[2025-08-01T22:33:43.894Z] add modules: java.net.http java.logging java.base
[2025-08-01T22:33:43.894Z] add exports: java.base/sun.net ALL-UNNAMED
[2025-08-01T22:33:43.894Z] java.base/sun.net.www ALL-UNNAMED
[2025-08-01T22:33:43.894Z] java.base/sun.net.www.http ALL-UNNAMED
[2025-08-01T22:33:43.894Z] java.net.http/jdk.internal.net.http.common ALL-UNNAMED
[2025-08-01T22:33:43.894Z] java.net.http/jdk.internal.net.http.frame ALL-UNNAMED
[2025-08-01T22:33:43.894Z] java.net.http/jdk.internal.net.http.hpack ALL-UNNAMED
[2025-08-01T22:33:43.894Z] source path: /home/jenkins/workspace/Test_openjdk11_hs_extended.openjdk_s390x_linux_testList_2/aqa-tests/openjdk/openjdk-jdk/test/lib
[2025-08-01T22:33:43.894Z] /home/jenkins/workspace/Test_openjdk11_hs_extended.openjdk_s390x_linux_testList_2/aqa-tests/openjdk/openjdk-jdk/test/jdk/java/net/httpclient/http2/server
[2025-08-01T22:33:43.894Z] /home/jenkins/workspace/Test_openjdk11_hs_extended.openjdk_s390x_linux_testList_2/aqa-tests/openjdk/openjdk-jdk/test/jdk/java/net/httpclient
[2025-08-01T22:33:43.894Z] class path: /home/jenkins/workspace/Test_openjdk11_hs_extended.openjdk_s390x_linux_testList_2/aqa-tests/TKG/output_1754086839279/jdk_net_1/work/classes/test/lib
[2025-08-01T22:33:43.894Z] /home/jenkins/workspace/Test_openjdk11_hs_extended.openjdk_s390x_linux_testList_2/aqa-tests/TKG/output_1754086839279/jdk_net_1/work/classes/java/net/httpclient/http2/server
[2025-08-01T22:33:43.894Z] /home/jenkins/workspace/Test_openjdk11_hs_extended.openjdk_s390x_linux_testList_2/aqa-tests/TKG/output_1754086839279/jdk_net_1/work/classes/java/net/httpclient
[2025-08-01T22:33:43.894Z] /home/jenkins/workspace/Test_openjdk11_hs_extended.openjdk_s390x_linux_testList_2/jvmtest/openjdk/jtreg/lib/junit-platform-console-standalone-1.9.2.jar
[2025-08-01T22:33:43.894Z]
[2025-08-01T22:33:43.894Z] rerun:
[2025-08-01T22:33:43.894Z] cd /home/jenkins/workspace/Test_openjdk11_hs_extended.openjdk_s390x_linux_testList_2/aqa-tests/TKG/output_1754086839279/jdk_net_1/work/scratch && \
[2025-08-01T22:33:43.894Z] DBUS_SESSION_BUS_ADDRESS=unix:path=/run/user/1002/bus \
[2025-08-01T22:33:43.894Z] DISPLAY=:0 \
[2025-08-01T22:33:43.894Z] HOME=/home/jenkins \
[2025-08-01T22:33:43.894Z] LANG=C.UTF-8 \
[2025-08-01T22:33:43.894Z] PATH=/bin:/usr/bin:/usr/sbin \
[2025-08-01T22:33:43.894Z] XDG_RUNTIME_DIR=/run/user/1002 \
[2025-08-01T22:33:43.894Z] XDG_SESSION_CLASS=user \
[2025-08-01T22:33:43.894Z] XDG_SESSION_ID=1195 \
[2025-08-01T22:33:43.894Z] XDG_SESSION_TYPE=tty \
[2025-08-01T22:33:43.894Z] /home/jenkins/workspace/Test_openjdk11_hs_extended.openjdk_s390x_linux_testList_2/jdkbinary/j2sdk-image/bin/javac \
[2025-08-01T22:33:43.894Z] -J-ea \
[2025-08-01T22:33:43.894Z] -J-esa \
[2025-08-01T22:33:43.894Z] -J-Xmx512m \
[2025-08-01T22:33:43.894Z] -J-XX:-UseCompressedOops \
[2025-08-01T22:33:43.894Z] -J-Dtest.vm.opts='-ea -esa -Xmx512m -XX:-UseCompressedOops' \
[2025-08-01T22:33:43.894Z] -J-Dtest.tool.vm.opts='-J-ea -J-esa -J-Xmx512m -J-XX:-UseCompressedOops' \
[2025-08-01T22:33:43.894Z] -J-Dtest.compiler.opts= \
[2025-08-01T22:33:43.894Z] -J-Dtest.java.opts= \
[2025-08-01T22:33:43.894Z] -J-Dtest.jdk=/home/jenkins/workspace/Test_openjdk11_hs_extended.openjdk_s390x_linux_testList_2/jdkbinary/j2sdk-image \
[2025-08-01T22:33:43.894Z] -J-Dcompile.jdk=/home/jenkins/workspace/Test_openjdk11_hs_extended.openjdk_s390x_linux_testList_2/jdkbinary/j2sdk-image \
[2025-08-01T22:33:43.894Z] -J-Dtest.timeout.factor=8.0 \
[2025-08-01T22:33:43.894Z] -J-Dtest.nativepath=/home/jenkins/workspace/Test_openjdk11_hs_extended.openjdk_s390x_linux_testList_2/jdkbinary/openjdk-test-image/jdk/jtreg/native \
[2025-08-01T22:33:43.894Z] -J-Dtest.root=/home/jenkins/workspace/Test_openjdk11_hs_extended.openjdk_s390x_linux_testList_2/aqa-tests/openjdk/openjdk-jdk/test/jdk \
[2025-08-01T22:33:43.894Z] -J-Dtest.name=java/net/httpclient/http2/ConnectionReuseTest.java \
[2025-08-01T22:33:43.894Z] -J-Dtest.file=/home/jenkins/workspace/Test_openjdk11_hs_extended.openjdk_s390x_linux_testList_2/aqa-tests/openjdk/openjdk-jdk/test/jdk/java/net/httpclient/http2/ConnectionReuseTest.java \
[2025-08-01T22:33:43.894Z] -J-Dtest.src=/home/jenkins/workspace/Test_openjdk11_hs_extended.openjdk_s390x_linux_testList_2/aqa-tests/openjdk/openjdk-jdk/test/jdk/java/net/httpclient/http2 \
[2025-08-01T22:33:43.894Z] -J-Dtest.src.path=/home/jenkins/workspace/Test_openjdk11_hs_extended.openjdk_s390x_linux_testList_2/aqa-tests/openjdk/openjdk-jdk/test/jdk/java/net/httpclient/http2:/home/jenkins/workspace/Test_openjdk11_hs_extended.openjdk_s390x_linux_testList_2/aqa-tests/openjdk/openjdk-jdk/test/lib:/home/jenkins/workspace/Test_openjdk11_hs_extended.openjdk_s390x_linux_testList_2/aqa-tests/openjdk/openjdk-jdk/test/jdk/java/net/httpclient/http2/server:/home/jenkins/workspace/Test_openjdk11_hs_extended.openjdk_s390x_linux_testList_2/aqa-tests/openjdk/openjdk-jdk/test/jdk/java/net/httpclient \
[2025-08-01T22:33:43.894Z] -J-Dtest.classes=/home/jenkins/workspace/Test_openjdk11_hs_extended.openjdk_s390x_linux_testList_2/aqa-tests/TKG/output_1754086839279/jdk_net_1/work/classes/java/net/httpclient/http2/ConnectionReuseTest.d \
[2025-08-01T22:33:43.894Z] -J-Dtest.class.path=/home/jenkins/workspace/Test_openjdk11_hs_extended.openjdk_s390x_linux_testList_2/aqa-tests/TKG/output_1754086839279/jdk_net_1/work/classes/java/net/httpclient/http2/ConnectionReuseTest.d:/home/jenkins/workspace/Test_openjdk11_hs_extended.openjdk_s390x_linux_testList_2/aqa-tests/TKG/output_1754086839279/jdk_net_1/work/classes/test/lib:/home/jenkins/workspace/Test_openjdk11_hs_extended.openjdk_s390x_linux_testList_2/aqa-tests/TKG/output_1754086839279/jdk_net_1/work/classes/java/net/httpclient/http2/server:/home/jenkins/workspace/Test_openjdk11_hs_extended.openjdk_s390x_linux_testList_2/aqa-tests/TKG/output_1754086839279/jdk_net_1/work/classes/java/net/httpclient \
[2025-08-01T22:33:43.894Z] -J-Dtest.class.path.prefix=/home/jenkins/workspace/Test_openjdk11_hs_extended.openjdk_s390x_linux_testList_2/aqa-tests/openjdk/openjdk-jdk/test/jdk/java/net/httpclient/http2:/home/jenkins/workspace/Test_openjdk11_hs_extended.openjdk_s390x_linux_testList_2/aqa-tests/TKG/output_1754086839279/jdk_net_1/work/classes/test/lib:/home/jenkins/workspace/Test_openjdk11_hs_extended.openjdk_s390x_linux_testList_2/aqa-tests/TKG/output_1754086839279/jdk_net_1/work/classes/java/net/httpclient/http2/server:/home/jenkins/workspace/Test_openjdk11_hs_extended.openjdk_s390x_linux_testList_2/aqa-tests/TKG/output_1754086839279/jdk_net_1/work/classes/java/net/httpclient \
[2025-08-01T22:33:43.894Z] -J-Dtest.modules='java.net.http/jdk.internal.net.http.common java.net.http/jdk.internal.net.http.frame java.net.http/jdk.internal.net.http.hpack java.logging java.base/sun.net.www.http java.base/sun.net.www java.base/sun.net' \
[2025-08-01T22:33:43.894Z] --add-modules java.net.http,java.logging,java.base \
[2025-08-01T22:33:43.894Z] --add-exports java.net.http/jdk.internal.net.http.common=ALL-UNNAMED \
[2025-08-01T22:33:43.894Z] --add-exports java.net.http/jdk.internal.net.http.frame=ALL-UNNAMED \
[2025-08-01T22:33:43.894Z] --add-exports java.net.http/jdk.internal.net.http.hpack=ALL-UNNAMED \
[2025-08-01T22:33:43.895Z] --add-exports java.base/sun.net.www.http=ALL-UNNAMED \
[2025-08-01T22:33:43.895Z] --add-exports java.base/sun.net.www=ALL-UNNAMED \
[2025-08-01T22:33:43.895Z] --add-exports java.base/sun.net=ALL-UNNAMED \
[2025-08-01T22:33:43.895Z] -d /home/jenkins/workspace/Test_openjdk11_hs_extended.openjdk_s390x_linux_testList_2/aqa-tests/TKG/output_1754086839279/jdk_net_1/work/classes/test/lib \
[2025-08-01T22:33:43.895Z] -sourcepath /home/jenkins/workspace/Test_openjdk11_hs_extended.openjdk_s390x_linux_testList_2/aqa-tests/openjdk/openjdk-jdk/test/lib:/home/jenkins/workspace/Test_openjdk11_hs_extended.openjdk_s390x_linux_testList_2/aqa-tests/openjdk/openjdk-jdk/test/jdk/java/net/httpclient/http2/server:/home/jenkins/workspace/Test_openjdk11_hs_extended.openjdk_s390x_linux_testList_2/aqa-tests/openjdk/openjdk-jdk/test/jdk/java/net/httpclient \
[2025-08-01T22:33:43.895Z] -classpath /home/jenkins/workspace/Test_openjdk11_hs_extended.openjdk_s390x_linux_testList_2/aqa-tests/TKG/output_1754086839279/jdk_net_1/work/classes/test/lib:/home/jenkins/workspace/Test_openjdk11_hs_extended.openjdk_s390x_linux_testList_2/aqa-tests/TKG/output_1754086839279/jdk_net_1/work/classes/java/net/httpclient/http2/server:/home/jenkins/workspace/Test_openjdk11_hs_extended.openjdk_s390x_linux_testList_2/aqa-tests/TKG/output_1754086839279/jdk_net_1/work/classes/java/net/httpclient:/home/jenkins/workspace/Test_openjdk11_hs_extended.openjdk_s390x_linux_testList_2/jvmtest/openjdk/jtreg/lib/junit-platform-console-standalone-1.9.2.jar /home/jenkins/workspace/Test_openjdk11_hs_extended.openjdk_s390x_linux_testList_2/aqa-tests/openjdk/openjdk-jdk/test/lib/jdk/test/lib/net/IPSupport.java
[2025-08-01T22:33:43.895Z]
[2025-08-01T22:33:43.895Z] ACTION: build -- Passed. Build successful
[2025-08-01T22:33:43.895Z] REASON: Named class compiled on demand
[2025-08-01T22:33:43.895Z] TIME: 0.374 seconds
[2025-08-01T22:33:43.895Z] messages:
[2025-08-01T22:33:43.895Z] command: build ConnectionReuseTest
[2025-08-01T22:33:43.895Z] reason: Named class compiled on demand
[2025-08-01T22:33:43.895Z] started: Fri Aug 01 22:33:34 UTC 2025
[2025-08-01T22:33:43.895Z] Test directory:
[2025-08-01T22:33:43.895Z] compile: ConnectionReuseTest
[2025-08-01T22:33:43.895Z] finished: Fri Aug 01 22:33:34 UTC 2025
[2025-08-01T22:33:43.895Z] elapsed time (seconds): 0.374
[2025-08-01T22:33:43.895Z]
[2025-08-01T22:33:43.895Z] ACTION: compile -- Passed. Compilation successful
[2025-08-01T22:33:43.895Z] REASON: .class file out of date or does not exist
[2025-08-01T22:33:43.895Z] TIME: 0.372 seconds
[2025-08-01T22:33:43.895Z] messages:
[2025-08-01T22:33:43.895Z] command: compile /home/jenkins/workspace/Test_openjdk11_hs_extended.openjdk_s390x_linux_testList_2/aqa-tests/openjdk/openjdk-jdk/test/jdk/java/net/httpclient/http2/ConnectionReuseTest.java
[2025-08-01T22:33:43.895Z] reason: .class file out of date or does not exist
[2025-08-01T22:33:43.895Z] started: Fri Aug 01 22:33:34 UTC 2025
[2025-08-01T22:33:43.895Z] Additional options from @modules: --add-modules java.net.http,java.logging,java.base --add-exports java.net.http/jdk.internal.net.http.common=ALL-UNNAMED --add-exports java.net.http/jdk.internal.net.http.frame=ALL-UNNAMED --add-exports java.net.http/jdk.internal.net.http.hpack=ALL-UNNAMED --add-exports java.base/sun.net.www.http=ALL-UNNAMED --add-exports java.base/sun.net.www=ALL-UNNAMED --add-exports java.base/sun.net=ALL-UNNAMED
[2025-08-01T22:33:43.895Z] Mode: agentvm
[2025-08-01T22:33:43.895Z] Agent id: 1
[2025-08-01T22:33:43.895Z] finished: Fri Aug 01 22:33:34 UTC 2025
[2025-08-01T22:33:43.895Z] elapsed time (seconds): 0.372
[2025-08-01T22:33:43.895Z] configuration:
[2025-08-01T22:33:43.895Z] Boot Layer (javac runtime environment)
[2025-08-01T22:33:43.895Z] class path: /home/jenkins/workspace/Test_openjdk11_hs_extended.openjdk_s390x_linux_testList_2/jvmtest/openjdk/jtreg/lib/javatest.jar
[2025-08-01T22:33:43.895Z] /home/jenkins/workspace/Test_openjdk11_hs_extended.openjdk_s390x_linux_testList_2/jvmtest/openjdk/jtreg/lib/jtreg.jar
[2025-08-01T22:33:43.895Z] patch: java.base /home/jenkins/workspace/Test_openjdk11_hs_extended.openjdk_s390x_linux_testList_2/aqa-tests/TKG/output_1754086839279/jdk_net_1/work/patches/java.base
[2025-08-01T22:33:43.895Z]
[2025-08-01T22:33:43.895Z] javac compilation environment
[2025-08-01T22:33:43.895Z] add modules: java.net.http java.logging java.base
[2025-08-01T22:33:43.895Z] add exports: java.base/sun.net ALL-UNNAMED
[2025-08-01T22:33:43.895Z] java.base/sun.net.www ALL-UNNAMED
[2025-08-01T22:33:43.895Z] java.base/sun.net.www.http ALL-UNNAMED
[2025-08-01T22:33:43.895Z] java.net.http/jdk.internal.net.http.common ALL-UNNAMED
[2025-08-01T22:33:43.895Z] java.net.http/jdk.internal.net.http.frame ALL-UNNAMED
[2025-08-01T22:33:43.895Z] java.net.http/jdk.internal.net.http.hpack ALL-UNNAMED
[2025-08-01T22:33:43.895Z] source path: /home/jenkins/workspace/Test_openjdk11_hs_extended.openjdk_s390x_linux_testList_2/aqa-tests/openjdk/openjdk-jdk/test/jdk/java/net/httpclient/http2
[2025-08-01T22:33:43.895Z] /home/jenkins/workspace/Test_openjdk11_hs_extended.openjdk_s390x_linux_testList_2/aqa-tests/openjdk/openjdk-jdk/test/lib
[2025-08-01T22:33:43.895Z] /home/jenkins/workspace/Test_openjdk11_hs_extended.openjdk_s390x_linux_testList_2/aqa-tests/openjdk/openjdk-jdk/test/jdk/java/net/httpclient/http2/server
[2025-08-01T22:33:43.895Z] /home/jenkins/workspace/Test_openjdk11_hs_extended.openjdk_s390x_linux_testList_2/aqa-tests/openjdk/openjdk-jdk/test/jdk/java/net/httpclient
[2025-08-01T22:33:43.895Z] class path: /home/jenkins/workspace/Test_openjdk11_hs_extended.openjdk_s390x_linux_testList_2/aqa-tests/openjdk/openjdk-jdk/test/jdk/java/net/httpclient/http2
[2025-08-01T22:33:43.895Z] /home/jenkins/workspace/Test_openjdk11_hs_extended.openjdk_s390x_linux_testList_2/aqa-tests/TKG/output_1754086839279/jdk_net_1/work/classes/java/net/httpclient/http2/ConnectionReuseTest.d
[2025-08-01T22:33:43.895Z] /home/jenkins/workspace/Test_openjdk11_hs_extended.openjdk_s390x_linux_testList_2/aqa-tests/TKG/output_1754086839279/jdk_net_1/work/classes/test/lib
[2025-08-01T22:33:43.895Z] /home/jenkins/workspace/Test_openjdk11_hs_extended.openjdk_s390x_linux_testList_2/aqa-tests/TKG/output_1754086839279/jdk_net_1/work/classes/java/net/httpclient/http2/server
[2025-08-01T22:33:43.895Z] /home/jenkins/workspace/Test_openjdk11_hs_extended.openjdk_s390x_linux_testList_2/aqa-tests/TKG/output_1754086839279/jdk_net_1/work/classes/java/net/httpclient
[2025-08-01T22:33:43.895Z] /home/jenkins/workspace/Test_openjdk11_hs_extended.openjdk_s390x_linux_testList_2/jvmtest/openjdk/jtreg/lib/junit-platform-console-standalone-1.9.2.jar
[2025-08-01T22:33:43.895Z]
[2025-08-01T22:33:43.895Z] rerun:
[2025-08-01T22:33:43.895Z] cd /home/jenkins/workspace/Test_openjdk11_hs_extended.openjdk_s390x_linux_testList_2/aqa-tests/TKG/output_1754086839279/jdk_net_1/work/scratch && \
[2025-08-01T22:33:43.895Z] DBUS_SESSION_BUS_ADDRESS=unix:path=/run/user/1002/bus \
[2025-08-01T22:33:43.895Z] DISPLAY=:0 \
[2025-08-01T22:33:43.895Z] HOME=/home/jenkins \
[2025-08-01T22:33:43.895Z] LANG=C.UTF-8 \
[2025-08-01T22:33:43.895Z] PATH=/bin:/usr/bin:/usr/sbin \
[2025-08-01T22:33:43.895Z] XDG_RUNTIME_DIR=/run/user/1002 \
[2025-08-01T22:33:43.895Z] XDG_SESSION_CLASS=user \
[2025-08-01T22:33:43.895Z] XDG_SESSION_ID=1195 \
[2025-08-01T22:33:43.895Z] XDG_SESSION_TYPE=tty \
[2025-08-01T22:33:43.895Z] /home/jenkins/workspace/Test_openjdk11_hs_extended.openjdk_s390x_linux_testList_2/jdkbinary/j2sdk-image/bin/javac \
[2025-08-01T22:33:43.895Z] -J-ea \
[2025-08-01T22:33:43.895Z] -J-esa \
[2025-08-01T22:33:43.895Z] -J-Xmx512m \
[2025-08-01T22:33:43.895Z] -J-XX:-UseCompressedOops \
[2025-08-01T22:33:43.895Z] -J-Dtest.vm.opts='-ea -esa -Xmx512m -XX:-UseCompressedOops' \
[2025-08-01T22:33:43.895Z] -J-Dtest.tool.vm.opts='-J-ea -J-esa -J-Xmx512m -J-XX:-UseCompressedOops' \
[2025-08-01T22:33:43.895Z] -J-Dtest.compiler.opts= \
[2025-08-01T22:33:43.895Z] -J-Dtest.java.opts= \
[2025-08-01T22:33:43.895Z] -J-Dtest.jdk=/home/jenkins/workspace/Test_openjdk11_hs_extended.openjdk_s390x_linux_testList_2/jdkbinary/j2sdk-image \
[2025-08-01T22:33:43.895Z] -J-Dcompile.jdk=/home/jenkins/workspace/Test_openjdk11_hs_extended.openjdk_s390x_linux_testList_2/jdkbinary/j2sdk-image \
[2025-08-01T22:33:43.895Z] -J-Dtest.timeout.factor=8.0 \
[2025-08-01T22:33:43.895Z] -J-Dtest.nativepath=/home/jenkins/workspace/Test_openjdk11_hs_extended.openjdk_s390x_linux_testList_2/jdkbinary/openjdk-test-image/jdk/jtreg/native \
[2025-08-01T22:33:43.895Z] -J-Dtest.root=/home/jenkins/workspace/Test_openjdk11_hs_extended.openjdk_s390x_linux_testList_2/aqa-tests/openjdk/openjdk-jdk/test/jdk \
[2025-08-01T22:33:43.895Z] -J-Dtest.name=java/net/httpclient/http2/ConnectionReuseTest.java \
[2025-08-01T22:33:43.895Z] -J-Dtest.file=/home/jenkins/workspace/Test_openjdk11_hs_extended.openjdk_s390x_linux_testList_2/aqa-tests/openjdk/openjdk-jdk/test/jdk/java/net/httpclient/http2/ConnectionReuseTest.java \
[2025-08-01T22:33:43.895Z] -J-Dtest.src=/home/jenkins/workspace/Test_openjdk11_hs_extended.openjdk_s390x_linux_testList_2/aqa-tests/openjdk/openjdk-jdk/test/jdk/java/net/httpclient/http2 \
[2025-08-01T22:33:43.895Z] -J-Dtest.src.path=/home/jenkins/workspace/Test_openjdk11_hs_extended.openjdk_s390x_linux_testList_2/aqa-tests/openjdk/openjdk-jdk/test/jdk/java/net/httpclient/http2:/home/jenkins/workspace/Test_openjdk11_hs_extended.openjdk_s390x_linux_testList_2/aqa-tests/openjdk/openjdk-jdk/test/lib:/home/jenkins/workspace/Test_openjdk11_hs_extended.openjdk_s390x_linux_testList_2/aqa-tests/openjdk/openjdk-jdk/test/jdk/java/net/httpclient/http2/server:/home/jenkins/workspace/Test_openjdk11_hs_extended.openjdk_s390x_linux_testList_2/aqa-tests/openjdk/openjdk-jdk/test/jdk/java/net/httpclient \
[2025-08-01T22:33:43.895Z] -J-Dtest.classes=/home/jenkins/workspace/Test_openjdk11_hs_extended.openjdk_s390x_linux_testList_2/aqa-tests/TKG/output_1754086839279/jdk_net_1/work/classes/java/net/httpclient/http2/ConnectionReuseTest.d \
[2025-08-01T22:33:43.895Z] -J-Dtest.class.path=/home/jenkins/workspace/Test_openjdk11_hs_extended.openjdk_s390x_linux_testList_2/aqa-tests/TKG/output_1754086839279/jdk_net_1/work/classes/java/net/httpclient/http2/ConnectionReuseTest.d:/home/jenkins/workspace/Test_openjdk11_hs_extended.openjdk_s390x_linux_testList_2/aqa-tests/TKG/output_1754086839279/jdk_net_1/work/classes/test/lib:/home/jenkins/workspace/Test_openjdk11_hs_extended.openjdk_s390x_linux_testList_2/aqa-tests/TKG/output_1754086839279/jdk_net_1/work/classes/java/net/httpclient/http2/server:/home/jenkins/workspace/Test_openjdk11_hs_extended.openjdk_s390x_linux_testList_2/aqa-tests/TKG/output_1754086839279/jdk_net_1/work/classes/java/net/httpclient \
[2025-08-01T22:33:43.896Z] -J-Dtest.class.path.prefix=/home/jenkins/workspace/Test_openjdk11_hs_extended.openjdk_s390x_linux_testList_2/aqa-tests/TKG/output_1754086839279/jdk_net_1/work/classes/java/net/httpclient/http2/ConnectionReuseTest.d:/home/jenkins/workspace/Test_openjdk11_hs_extended.openjdk_s390x_linux_testList_2/aqa-tests/openjdk/openjdk-jdk/test/jdk/java/net/httpclient/http2:/home/jenkins/workspace/Test_openjdk11_hs_extended.openjdk_s390x_linux_testList_2/aqa-tests/TKG/output_1754086839279/jdk_net_1/work/classes/test/lib:/home/jenkins/workspace/Test_openjdk11_hs_extended.openjdk_s390x_linux_testList_2/aqa-tests/TKG/output_1754086839279/jdk_net_1/work/classes/java/net/httpclient/http2/server:/home/jenkins/workspace/Test_openjdk11_hs_extended.openjdk_s390x_linux_testList_2/aqa-tests/TKG/output_1754086839279/jdk_net_1/work/classes/java/net/httpclient \
[2025-08-01T22:33:43.896Z] -J-Dtest.modules='java.net.http/jdk.internal.net.http.common java.net.http/jdk.internal.net.http.frame java.net.http/jdk.internal.net.http.hpack java.logging java.base/sun.net.www.http java.base/sun.net.www java.base/sun.net' \
[2025-08-01T22:33:43.896Z] --add-modules java.net.http,java.logging,java.base \
[2025-08-01T22:33:43.896Z] --add-exports java.net.http/jdk.internal.net.http.common=ALL-UNNAMED \
[2025-08-01T22:33:43.896Z] --add-exports java.net.http/jdk.internal.net.http.frame=ALL-UNNAMED \
[2025-08-01T22:33:43.896Z] --add-exports java.net.http/jdk.internal.net.http.hpack=ALL-UNNAMED \
[2025-08-01T22:33:43.896Z] --add-exports java.base/sun.net.www.http=ALL-UNNAMED \
[2025-08-01T22:33:43.896Z] --add-exports java.base/sun.net.www=ALL-UNNAMED \
[2025-08-01T22:33:43.896Z] --add-exports java.base/sun.net=ALL-UNNAMED \
[2025-08-01T22:33:43.896Z] -d /home/jenkins/workspace/Test_openjdk11_hs_extended.openjdk_s390x_linux_testList_2/aqa-tests/TKG/output_1754086839279/jdk_net_1/work/classes/java/net/httpclient/http2/ConnectionReuseTest.d \
[2025-08-01T22:33:43.896Z] -sourcepath /home/jenkins/workspace/Test_openjdk11_hs_extended.openjdk_s390x_linux_testList_2/aqa-tests/openjdk/openjdk-jdk/test/jdk/java/net/httpclient/http2:/home/jenkins/workspace/Test_openjdk11_hs_extended.openjdk_s390x_linux_testList_2/aqa-tests/openjdk/openjdk-jdk/test/lib:/home/jenkins/workspace/Test_openjdk11_hs_extended.openjdk_s390x_linux_testList_2/aqa-tests/openjdk/openjdk-jdk/test/jdk/java/net/httpclient/http2/server:/home/jenkins/workspace/Test_openjdk11_hs_extended.openjdk_s390x_linux_testList_2/aqa-tests/openjdk/openjdk-jdk/test/jdk/java/net/httpclient \
[2025-08-01T22:33:43.896Z] -classpath /home/jenkins/workspace/Test_openjdk11_hs_extended.openjdk_s390x_linux_testList_2/aqa-tests/openjdk/openjdk-jdk/test/jdk/java/net/httpclient/http2:/home/jenkins/workspace/Test_openjdk11_hs_extended.openjdk_s390x_linux_testList_2/aqa-tests/TKG/output_1754086839279/jdk_net_1/work/classes/java/net/httpclient/http2/ConnectionReuseTest.d:/home/jenkins/workspace/Test_openjdk11_hs_extended.openjdk_s390x_linux_testList_2/aqa-tests/TKG/output_1754086839279/jdk_net_1/work/classes/test/lib:/home/jenkins/workspace/Test_openjdk11_hs_extended.openjdk_s390x_linux_testList_2/aqa-tests/TKG/output_1754086839279/jdk_net_1/work/classes/java/net/httpclient/http2/server:/home/jenkins/workspace/Test_openjdk11_hs_extended.openjdk_s390x_linux_testList_2/aqa-tests/TKG/output_1754086839279/jdk_net_1/work/classes/java/net/httpclient:/home/jenkins/workspace/Test_openjdk11_hs_extended.openjdk_s390x_linux_testList_2/jvmtest/openjdk/jtreg/lib/junit-platform-console-standalone-1.9.2.jar /home/jenkins/workspace/Test_openjdk11_hs_extended.openjdk_s390x_linux_testList_2/aqa-tests/openjdk/openjdk-jdk/test/jdk/java/net/httpclient/http2/ConnectionReuseTest.java
[2025-08-01T22:33:43.896Z]
[2025-08-01T22:33:43.896Z] ACTION: junit -- Passed. Execution successful
[2025-08-01T22:33:43.896Z] REASON: User specified action: run junit/othervm ConnectionReuseTest
[2025-08-01T22:33:43.896Z] TIME: 3.702 seconds
[2025-08-01T22:33:43.896Z] messages:
[2025-08-01T22:33:43.896Z] command: junit ConnectionReuseTest
[2025-08-01T22:33:43.896Z] reason: User specified action: run junit/othervm ConnectionReuseTest
[2025-08-01T22:33:43.896Z] started: Fri Aug 01 22:33:34 UTC 2025
[2025-08-01T22:33:43.896Z] Mode: othervm [/othervm specified]
[2025-08-01T22:33:43.896Z] Additional options from @modules: --add-modules java.net.http,java.logging,java.base --add-exports java.net.http/jdk.internal.net.http.common=ALL-UNNAMED --add-exports java.net.http/jdk.internal.net.http.frame=ALL-UNNAMED --add-exports java.net.http/jdk.internal.net.http.hpack=ALL-UNNAMED --add-exports java.base/sun.net.www.http=ALL-UNNAMED --add-exports java.base/sun.net.www=ALL-UNNAMED --add-exports java.base/sun.net=ALL-UNNAMED
[2025-08-01T22:33:43.896Z] finished: Fri Aug 01 22:33:38 UTC 2025
[2025-08-01T22:33:43.896Z] elapsed time (seconds): 3.702
[2025-08-01T22:33:43.896Z] configuration:
[2025-08-01T22:33:43.896Z] Boot Layer
[2025-08-01T22:33:43.896Z] add modules: java.net.http java.logging java.base
[2025-08-01T22:33:43.896Z] add exports: java.base/sun.net ALL-UNNAMED
[2025-08-01T22:33:43.896Z] java.base/sun.net.www ALL-UNNAMED
[2025-08-01T22:33:43.896Z] java.base/sun.net.www.http ALL-UNNAMED
[2025-08-01T22:33:43.896Z] java.net.http/jdk.internal.net.http.common ALL-UNNAMED
[2025-08-01T22:33:43.896Z] java.net.http/jdk.internal.net.http.frame ALL-UNNAMED
[2025-08-01T22:33:43.896Z] java.net.http/jdk.internal.net.http.hpack ALL-UNNAMED
[2025-08-01T22:33:43.896Z]
[2025-08-01T22:33:43.896Z] STDOUT:
[2025-08-01T22:33:43.896Z] Http2TestServerImpl[localhost/127.0.0.1:46061]::addHandler ConnectionReuseTest$Handler@609b3335, /
[2025-08-01T22:33:43.896Z] Http2TestServerImpl: start
[2025-08-01T22:33:43.896Z] Started HTTP v2 server at localhost:46061
[2025-08-01T22:33:43.896Z] Http2TestServerImpl[localhost/127.0.0.1:44839]::addHandler ConnectionReuseTest$Handler@771ae3fc, /
[2025-08-01T22:33:43.896Z] Http2TestServerImpl: start
[2025-08-01T22:33:43.896Z] Started HTTPS v2 server at localhost:44839
[2025-08-01T22:33:43.896Z] Issuing request(1) https://localhost:44839/ GET
[2025-08-01T22:33:43.896Z] Http2TestContext::handle Http2TestExchangeImpl: Http2TestExchangeImpl@3b013364
[2025-08-01T22:33:43.896Z] Handling request https://localhost:44839/ from /127.0.0.1:40502
[2025-08-01T22:33:43.896Z] Server side handler responded to a request from /127.0.0.1:40502
[2025-08-01T22:33:43.896Z] Issuing request(2) https://localhost:44839/ GET
[2025-08-01T22:33:43.896Z] Http2TestContext::handle Http2TestExchangeImpl: Http2TestExchangeImpl@a513fd1
[2025-08-01T22:33:43.896Z] Handling request https://localhost:44839/ from /127.0.0.1:40502
[2025-08-01T22:33:43.896Z] Server side handler responded to a request from /127.0.0.1:40502
[2025-08-01T22:33:43.896Z] Issuing request(3) https://localhost:44839/ GET
[2025-08-01T22:33:43.896Z] Http2TestContext::handle Http2TestExchangeImpl: Http2TestExchangeImpl@409259d1
[2025-08-01T22:33:43.896Z] Handling request https://localhost:44839/ from /127.0.0.1:40502
[2025-08-01T22:33:43.896Z] Server side handler responded to a request from /127.0.0.1:40502
[2025-08-01T22:33:43.896Z] Issuing request(4) https://localhost:44839/ GET
[2025-08-01T22:33:43.896Z] Http2TestContext::handle Http2TestExchangeImpl: Http2TestExchangeImpl@17e9fe7e
[2025-08-01T22:33:43.896Z] Handling request https://localhost:44839/ from /127.0.0.1:40502
[2025-08-01T22:33:43.896Z] Server side handler responded to a request from /127.0.0.1:40502
[2025-08-01T22:33:43.896Z] Issuing request(5) https://localhost:44839/ GET
[2025-08-01T22:33:43.896Z] Http2TestContext::handle Http2TestExchangeImpl: Http2TestExchangeImpl@b488b52
[2025-08-01T22:33:43.896Z] Handling request https://localhost:44839/ from /127.0.0.1:40502
[2025-08-01T22:33:43.896Z] Server side handler responded to a request from /127.0.0.1:40502
[2025-08-01T22:33:43.896Z] PASSED: No outstanding operations found in 1 clients
[2025-08-01T22:33:43.896Z] Issuing request(1) http://localhost:46061/ GET
[2025-08-01T22:33:43.896Z] Http2TestContext::handle Http2TestExchangeImpl: Http2TestExchangeImpl@ff94e32
[2025-08-01T22:33:43.896Z] Handling request http://localhost:46061/ from /127.0.0.1:51974
[2025-08-01T22:33:43.896Z] Server side handler responded to a request from /127.0.0.1:51974
[2025-08-01T22:33:43.896Z] Issuing request(2) http://localhost:46061/ GET
[2025-08-01T22:33:43.896Z] Http2TestContext::handle Http2TestExchangeImpl: Http2TestExchangeImpl@bc6cb15
[2025-08-01T22:33:43.896Z] Handling request http://localhost:46061/ from /127.0.0.1:51974
[2025-08-01T22:33:43.896Z] Server side handler responded to a request from /127.0.0.1:51974
[2025-08-01T22:33:43.896Z] Issuing request(3) http://localhost:46061/ GET
[2025-08-01T22:33:43.896Z] Http2TestContext::handle Http2TestExchangeImpl: Http2TestExchangeImpl@4ec44409
[2025-08-01T22:33:43.896Z] Handling request http://localhost:46061/ from /127.0.0.1:51974
[2025-08-01T22:33:43.896Z] Server side handler responded to a request from /127.0.0.1:51974
[2025-08-01T22:33:43.896Z] Issuing request(4) http://localhost:46061/ GET
[2025-08-01T22:33:43.896Z] Http2TestContext::handle Http2TestExchangeImpl: Http2TestExchangeImpl@3a8df83c
[2025-08-01T22:33:43.896Z] Handling request http://localhost:46061/ from /127.0.0.1:51974
[2025-08-01T22:33:43.896Z] Server side handler responded to a request from /127.0.0.1:51974
[2025-08-01T22:33:43.896Z] Issuing request(5) http://localhost:46061/ GET
[2025-08-01T22:33:43.896Z] Http2TestContext::handle Http2TestExchangeImpl: Http2TestExchangeImpl@7fc0a981
[2025-08-01T22:33:43.896Z] Handling request http://localhost:46061/ from /127.0.0.1:51974
[2025-08-01T22:33:43.896Z] Server side handler responded to a request from /127.0.0.1:51974
[2025-08-01T22:33:43.896Z] PASSED: No outstanding operations found in 2 clients
[2025-08-01T22:33:43.896Z] Stopping server HttpServerAdapters$HttpTestServer$Http2TestServerImpl@46282f43
[2025-08-01T22:33:43.896Z] Http2TestServerImpl: stop
[2025-08-01T22:33:43.896Z] Stopping server HttpServerAdapters$HttpTestServer$Http2TestServerImpl@6b607529
[2025-08-01T22:33:43.896Z] Http2TestServerImpl: stop
[2025-08-01T22:33:43.896Z] STDERR:
[2025-08-01T22:33:43.896Z] STARTED ConnectionReuseTest::testConnReuse '[1] https://localhost:44839/'
[2025-08-01T22:33:43.896Z] TestServer: New connection from Socket[addr=/127.0.0.1,port=40502,localport=44839]
[2025-08-01T22:33:43.896Z] TestServer: GET /
[2025-08-01T22:33:43.896Z] Server: got END_STREAM for stream 1
[2025-08-01T22:33:43.896Z] Using handler for: /
[2025-08-01T22:33:43.896Z] Sent response headers 200
[2025-08-01T22:33:43.896Z] TestServer: GET /
[2025-08-01T22:33:43.896Z] Server: got END_STREAM for stream 3
[2025-08-01T22:33:43.896Z] Using handler for: /
[2025-08-01T22:33:43.896Z] Sent response headers 200
[2025-08-01T22:33:43.896Z] TestServer: GET /
[2025-08-01T22:33:43.896Z] Server: got END_STREAM for stream 5
[2025-08-01T22:33:43.896Z] Using handler for: /
[2025-08-01T22:33:43.896Z] Sent response headers 200
[2025-08-01T22:33:43.896Z] TestServer: GET /
[2025-08-01T22:33:43.896Z] Server: got END_STREAM for stream 7
[2025-08-01T22:33:43.896Z] Using handler for: /
[2025-08-01T22:33:43.896Z] Sent response headers 200
[2025-08-01T22:33:43.896Z] TestServer: GET /
[2025-08-01T22:33:43.896Z] Server: got END_STREAM for stream 9
[2025-08-01T22:33:43.896Z] Using handler for: /
[2025-08-01T22:33:43.896Z] Sent response headers 200
[2025-08-01T22:33:43.896Z] SUCCESSFUL ConnectionReuseTest::testConnReuse '[1] https://localhost:44839/'
[2025-08-01T22:33:43.896Z] STARTED ConnectionReuseTest::testConnReuse '[2] http://localhost:46061/'
[2025-08-01T22:33:43.896Z] TestServer: New connection from Socket[addr=/127.0.0.1,port=51974,localport=46061]
[2025-08-01T22:33:43.896Z] TestServer: GET /
[2025-08-01T22:33:43.896Z] Server: creating input stream for stream 1
[2025-08-01T22:33:43.896Z] Using handler for: /
[2025-08-01T22:33:43.896Z] Sent response headers 200
[2025-08-01T22:33:43.896Z] TestServer: GET /
[2025-08-01T22:33:43.896Z] Server: got END_STREAM for stream 3
[2025-08-01T22:33:43.897Z] Using handler for: /
[2025-08-01T22:33:43.897Z] Sent response headers 200
[2025-08-01T22:33:43.897Z] TestServer: GET /
[2025-08-01T22:33:43.897Z] Server: got END_STREAM for stream 5
[2025-08-01T22:33:43.897Z] Using handler for: /
[2025-08-01T22:33:43.897Z] Sent response headers 200
[2025-08-01T22:33:43.897Z] TestServer: GET /
[2025-08-01T22:33:43.897Z] Server: got END_STREAM for stream 7
[2025-08-01T22:33:43.897Z] Using handler for: /
[2025-08-01T22:33:43.897Z] Sent response headers 200
[2025-08-01T22:33:43.897Z] TestServer: GET /
[2025-08-01T22:33:43.897Z] Server: got END_STREAM for stream 9
[2025-08-01T22:33:43.897Z] Using handler for: /
[2025-08-01T22:33:43.897Z] Sent response headers 200
[2025-08-01T22:33:43.897Z] SUCCESSFUL ConnectionReuseTest::testConnReuse '[2] http://localhost:46061/'
[2025-08-01T22:33:43.897Z] Server stopping 1 connections
[2025-08-01T22:33:43.897Z] Server connection to /127.0.0.1:40502 stopping. 5 streams
[2025-08-01T22:33:43.897Z] TestServer: Connection writer stopping
[2025-08-01T22:33:43.897Z] Server stopping 1 connections
[2025-08-01T22:33:43.897Z] Server connection to /127.0.0.1:51974 stopping. 5 streams
[2025-08-01T22:33:43.897Z] TestServer: Connection writer stopping
[2025-08-01T22:33:43.897Z]
[2025-08-01T22:33:43.897Z] [ JUnit Containers: found 5, started 5, succeeded 5, failed 0, aborted 0, skipped 0]
[2025-08-01T22:33:43.897Z] [ JUnit Tests: found 2, started 2, succeeded 2, failed 0, aborted 0, skipped 0]
[2025-08-01T22:33:43.897Z]
[2025-08-01T22:33:43.897Z] STATUS:Passed.
[2025-08-01T22:33:43.897Z] rerun:
[2025-08-01T22:33:43.897Z] cd /home/jenkins/workspace/Test_openjdk11_hs_extended.openjdk_s390x_linux_testList_2/aqa-tests/TKG/output_1754086839279/jdk_net_1/work/scratch && \
[2025-08-01T22:33:43.897Z] DBUS_SESSION_BUS_ADDRESS=unix:path=/run/user/1002/bus \
[2025-08-01T22:33:43.897Z] DISPLAY=:0 \
[2025-08-01T22:33:43.897Z] HOME=/home/jenkins \
[2025-08-01T22:33:43.897Z] LANG=C.UTF-8 \
[2025-08-01T22:33:43.897Z] PATH=/bin:/usr/bin:/usr/sbin \
[2025-08-01T22:33:43.897Z] XDG_RUNTIME_DIR=/run/user/1002 \
[2025-08-01T22:33:43.897Z] XDG_SESSION_CLASS=user \
[2025-08-01T22:33:43.897Z] XDG_SESSION_ID=1195 \
[2025-08-01T22:33:43.897Z] XDG_SESSION_TYPE=tty \
[2025-08-01T22:33:43.897Z] CLASSPATH=/home/jenkins/workspace/Test_openjdk11_hs_extended.openjdk_s390x_linux_testList_2/aqa-tests/TKG/output_1754086839279/jdk_net_1/work/classes/java/net/httpclient/http2/ConnectionReuseTest.d:/home/jenkins/workspace/Test_openjdk11_hs_extended.openjdk_s390x_linux_testList_2/aqa-tests/openjdk/openjdk-jdk/test/jdk/java/net/httpclient/http2:/home/jenkins/workspace/Test_openjdk11_hs_extended.openjdk_s390x_linux_testList_2/aqa-tests/TKG/output_1754086839279/jdk_net_1/work/classes/test/lib:/home/jenkins/workspace/Test_openjdk11_hs_extended.openjdk_s390x_linux_testList_2/aqa-tests/openjdk/openjdk-jdk/test/lib:/home/jenkins/workspace/Test_openjdk11_hs_extended.openjdk_s390x_linux_testList_2/aqa-tests/TKG/output_1754086839279/jdk_net_1/work/classes/java/net/httpclient/http2/server:/home/jenkins/workspace/Test_openjdk11_hs_extended.openjdk_s390x_linux_testList_2/aqa-tests/openjdk/openjdk-jdk/test/jdk/java/net/httpclient/http2/server:/home/jenkins/workspace/Test_openjdk11_hs_extended.openjdk_s390x_linux_testList_2/aqa-tests/TKG/output_1754086839279/jdk_net_1/work/classes/java/net/httpclient:/home/jenkins/workspace/Test_openjdk11_hs_extended.openjdk_s390x_linux_testList_2/aqa-tests/openjdk/openjdk-jdk/test/jdk/java/net/httpclient:/home/jenkins/workspace/Test_openjdk11_hs_extended.openjdk_s390x_linux_testList_2/jvmtest/openjdk/jtreg/lib/junit-platform-console-standalone-1.9.2.jar:/home/jenkins/workspace/Test_openjdk11_hs_extended.openjdk_s390x_linux_testList_2/jvmtest/openjdk/jtreg/lib/javatest.jar:/home/jenkins/workspace/Test_openjdk11_hs_extended.openjdk_s390x_linux_testList_2/jvmtest/openjdk/jtreg/lib/jtreg.jar \
[2025-08-01T22:33:43.897Z] /home/jenkins/workspace/Test_openjdk11_hs_extended.openjdk_s390x_linux_testList_2/jdkbinary/j2sdk-image/bin/java \
[2025-08-01T22:33:43.897Z] -Dtest.vm.opts='-ea -esa -Xmx512m -XX:-UseCompressedOops' \
[2025-08-01T22:33:43.897Z] -Dtest.tool.vm.opts='-J-ea -J-esa -J-Xmx512m -J-XX:-UseCompressedOops' \
[2025-08-01T22:33:43.897Z] -Dtest.compiler.opts= \
[2025-08-01T22:33:43.897Z] -Dtest.java.opts= \
[2025-08-01T22:33:43.897Z] -Dtest.jdk=/home/jenkins/workspace/Test_openjdk11_hs_extended.openjdk_s390x_linux_testList_2/jdkbinary/j2sdk-image \
[2025-08-01T22:33:43.897Z] -Dcompile.jdk=/home/jenkins/workspace/Test_openjdk11_hs_extended.openjdk_s390x_linux_testList_2/jdkbinary/j2sdk-image \
[2025-08-01T22:33:43.897Z] -Dtest.timeout.factor=8.0 \
[2025-08-01T22:33:43.897Z] -Dtest.nativepath=/home/jenkins/workspace/Test_openjdk11_hs_extended.openjdk_s390x_linux_testList_2/jdkbinary/openjdk-test-image/jdk/jtreg/native \
[2025-08-01T22:33:43.897Z] -Dtest.root=/home/jenkins/workspace/Test_openjdk11_hs_extended.openjdk_s390x_linux_testList_2/aqa-tests/openjdk/openjdk-jdk/test/jdk \
[2025-08-01T22:33:43.897Z] -Dtest.name=java/net/httpclient/http2/ConnectionReuseTest.java \
[2025-08-01T22:33:43.897Z] -Dtest.file=/home/jenkins/workspace/Test_openjdk11_hs_extended.openjdk_s390x_linux_testList_2/aqa-tests/openjdk/openjdk-jdk/test/jdk/java/net/httpclient/http2/ConnectionReuseTest.java \
[2025-08-01T22:33:43.897Z] -Dtest.src=/home/jenkins/workspace/Test_openjdk11_hs_extended.openjdk_s390x_linux_testList_2/aqa-tests/openjdk/openjdk-jdk/test/jdk/java/net/httpclient/http2 \
[2025-08-01T22:33:43.897Z] -Dtest.src.path=/home/jenkins/workspace/Test_openjdk11_hs_extended.openjdk_s390x_linux_testList_2/aqa-tests/openjdk/openjdk-jdk/test/jdk/java/net/httpclient/http2:/home/jenkins/workspace/Test_openjdk11_hs_extended.openjdk_s390x_linux_testList_2/aqa-tests/openjdk/openjdk-jdk/test/lib:/home/jenkins/workspace/Test_openjdk11_hs_extended.openjdk_s390x_linux_testList_2/aqa-tests/openjdk/openjdk-jdk/test/jdk/java/net/httpclient/http2/server:/home/jenkins/workspace/Test_openjdk11_hs_extended.openjdk_s390x_linux_testList_2/aqa-tests/openjdk/openjdk-jdk/test/jdk/java/net/httpclient \
[2025-08-01T22:33:43.897Z] -Dtest.classes=/home/jenkins/workspace/Test_openjdk11_hs_extended.openjdk_s390x_linux_testList_2/aqa-tests/TKG/output_1754086839279/jdk_net_1/work/classes/java/net/httpclient/http2/ConnectionReuseTest.d \
[2025-08-01T22:33:43.897Z] -Dtest.class.path=/home/jenkins/workspace/Test_openjdk11_hs_extended.openjdk_s390x_linux_testList_2/aqa-tests/TKG/output_1754086839279/jdk_net_1/work/classes/java/net/httpclient/http2/ConnectionReuseTest.d:/home/jenkins/workspace/Test_openjdk11_hs_extended.openjdk_s390x_linux_testList_2/aqa-tests/TKG/output_1754086839279/jdk_net_1/work/classes/test/lib:/home/jenkins/workspace/Test_openjdk11_hs_extended.openjdk_s390x_linux_testList_2/aqa-tests/TKG/output_1754086839279/jdk_net_1/work/classes/java/net/httpclient/http2/server:/home/jenkins/workspace/Test_openjdk11_hs_extended.openjdk_s390x_linux_testList_2/aqa-tests/TKG/output_1754086839279/jdk_net_1/work/classes/java/net/httpclient \
[2025-08-01T22:33:43.897Z] -Dtest.class.path.prefix=/home/jenkins/workspace/Test_openjdk11_hs_extended.openjdk_s390x_linux_testList_2/aqa-tests/TKG/output_1754086839279/jdk_net_1/work/classes/java/net/httpclient/http2/ConnectionReuseTest.d:/home/jenkins/workspace/Test_openjdk11_hs_extended.openjdk_s390x_linux_testList_2/aqa-tests/openjdk/openjdk-jdk/test/jdk/java/net/httpclient/http2:/home/jenkins/workspace/Test_openjdk11_hs_extended.openjdk_s390x_linux_testList_2/aqa-tests/TKG/output_1754086839279/jdk_net_1/work/classes/test/lib:/home/jenkins/workspace/Test_openjdk11_hs_extended.openjdk_s390x_linux_testList_2/aqa-tests/TKG/output_1754086839279/jdk_net_1/work/classes/java/net/httpclient/http2/server:/home/jenkins/workspace/Test_openjdk11_hs_extended.openjdk_s390x_linux_testList_2/aqa-tests/TKG/output_1754086839279/jdk_net_1/work/classes/java/net/httpclient \
[2025-08-01T22:33:43.897Z] -Dtest.modules='java.net.http/jdk.internal.net.http.common java.net.http/jdk.internal.net.http.frame java.net.http/jdk.internal.net.http.hpack java.logging java.base/sun.net.www.http java.base/sun.net.www java.base/sun.net' \
[2025-08-01T22:33:43.897Z] --add-modules java.net.http,java.logging,java.base \
[2025-08-01T22:33:43.897Z] --add-exports java.net.http/jdk.internal.net.http.common=ALL-UNNAMED \
[2025-08-01T22:33:43.897Z] --add-exports java.net.http/jdk.internal.net.http.frame=ALL-UNNAMED \
[2025-08-01T22:33:43.897Z] --add-exports java.net.http/jdk.internal.net.http.hpack=ALL-UNNAMED \
[2025-08-01T22:33:43.897Z] --add-exports java.base/sun.net.www.http=ALL-UNNAMED \
[2025-08-01T22:33:43.897Z] --add-exports java.base/sun.net.www=ALL-UNNAMED \
[2025-08-01T22:33:43.897Z] --add-exports java.base/sun.net=ALL-UNNAMED \
[2025-08-01T22:33:43.897Z] -ea \
[2025-08-01T22:33:43.897Z] -esa \
[2025-08-01T22:33:43.897Z] -Xmx512m \
[2025-08-01T22:33:43.897Z] -XX:-UseCompressedOops \
[2025-08-01T22:33:43.897Z] -Djava.library.path=/home/jenkins/workspace/Test_openjdk11_hs_extended.openjdk_s390x_linux_testList_2/jdkbinary/openjdk-test-image/jdk/jtreg/native \
[2025-08-01T22:33:43.897Z] com.sun.javatest.regtest.agent.MainWrapper /home/jenkins/workspace/Test_openjdk11_hs_extended.openjdk_s390x_linux_testList_2/aqa-tests/TKG/output_1754086839279/jdk_net_1/work/java/net/httpclient/http2/ConnectionReuseTest.d/junit.0.jta java/net/httpclient/http2/ConnectionReuseTest.java ConnectionReuseTest
[2025-08-01T22:33:43.897Z]
[2025-08-01T22:33:43.897Z] ACTION: build -- Passed. All files up to date
[2025-08-01T22:33:43.897Z] REASON: Named class compiled on demand
[2025-08-01T22:33:43.897Z] TIME: 0.001 seconds
[2025-08-01T22:33:43.897Z] messages:
[2025-08-01T22:33:43.897Z] command: build ConnectionReuseTest
[2025-08-01T22:33:43.897Z] reason: Named class compiled on demand
[2025-08-01T22:33:43.897Z] started: Fri Aug 01 22:33:38 UTC 2025
[2025-08-01T22:33:43.897Z] finished: Fri Aug 01 22:33:38 UTC 2025
[2025-08-01T22:33:43.897Z] elapsed time (seconds): 0.001
[2025-08-01T22:33:43.897Z]
[2025-08-01T22:33:43.897Z] ACTION: junit -- Failed. Execution failed: `main' threw exception: java.lang.Exception: JUnit test failure
[2025-08-01T22:33:43.897Z] REASON: User specified action: run junit/othervm -Djava.net.preferIPv6Addresses=true ConnectionReuseTest
[2025-08-01T22:33:43.897Z] TIME: 2.845 seconds
[2025-08-01T22:33:43.897Z] messages:
[2025-08-01T22:33:43.897Z] command: junit -Djava.net.preferIPv6Addresses=true ConnectionReuseTest
[2025-08-01T22:33:43.897Z] reason: User specified action: run junit/othervm -Djava.net.preferIPv6Addresses=true ConnectionReuseTest
[2025-08-01T22:33:43.897Z] started: Fri Aug 01 22:33:38 UTC 2025
[2025-08-01T22:33:43.897Z] Mode: othervm [/othervm specified]
[2025-08-01T22:33:43.897Z] Additional options from @modules: --add-modules java.net.http,java.logging,java.base --add-exports java.net.http/jdk.internal.net.http.common=ALL-UNNAMED --add-exports java.net.http/jdk.internal.net.http.frame=ALL-UNNAMED --add-exports java.net.http/jdk.internal.net.http.hpack=ALL-UNNAMED --add-exports java.base/sun.net.www.http=ALL-UNNAMED --add-exports java.base/sun.net.www=ALL-UNNAMED --add-exports java.base/sun.net=ALL-UNNAMED
[2025-08-01T22:33:43.897Z] finished: Fri Aug 01 22:33:41 UTC 2025
[2025-08-01T22:33:43.897Z] elapsed time (seconds): 2.845
[2025-08-01T22:33:43.897Z] configuration:
[2025-08-01T22:33:43.897Z] Boot Layer
[2025-08-01T22:33:43.897Z] add modules: java.net.http java.logging java.base
[2025-08-01T22:33:43.897Z] add exports: java.base/sun.net ALL-UNNAMED
[2025-08-01T22:33:43.897Z] java.base/sun.net.www ALL-UNNAMED
[2025-08-01T22:33:43.897Z] java.base/sun.net.www.http ALL-UNNAMED
[2025-08-01T22:33:43.897Z] java.net.http/jdk.internal.net.http.common ALL-UNNAMED
[2025-08-01T22:33:43.897Z] java.net.http/jdk.internal.net.http.frame ALL-UNNAMED
[2025-08-01T22:33:43.897Z] java.net.http/jdk.internal.net.http.hpack ALL-UNNAMED
[2025-08-01T22:33:43.897Z]
[2025-08-01T22:33:43.898Z] STDOUT:
[2025-08-01T22:33:43.898Z] Http2TestServerImpl[localhost/0:0:0:0:0:0:0:1:36389]::addHandler ConnectionReuseTest$Handler@42b76d04, /
[2025-08-01T22:33:43.898Z] Http2TestServerImpl: start
[2025-08-01T22:33:43.898Z] Started HTTP v2 server at localhost:36389
[2025-08-01T22:33:43.898Z] Http2TestServerImpl[localhost/0:0:0:0:0:0:0:1:60555]::addHandler ConnectionReuseTest$Handler@5b321c99, /
[2025-08-01T22:33:43.898Z] Http2TestServerImpl: start
[2025-08-01T22:33:43.898Z] Started HTTPS v2 server at localhost:60555
[2025-08-01T22:33:43.898Z] Issuing request(1) https://localhost:60555/ GET
[2025-08-01T22:33:43.898Z] PASSED: No outstanding operations found in 1 clients
[2025-08-01T22:33:43.898Z] Issuing request(1) http://localhost:36389/ GET
[2025-08-01T22:33:43.898Z] PASSED: No outstanding operations found in 2 clients
[2025-08-01T22:33:43.898Z] Issuing request(1) http://[::1]:36389/ GET
[2025-08-01T22:33:43.898Z] Http2TestContext::handle Http2TestExchangeImpl: Http2TestExchangeImpl@6647efb3
[2025-08-01T22:33:43.898Z] Handling request http://[::1]:36389/ from /0:0:0:0:0:0:0:1:47536
[2025-08-01T22:33:43.898Z] Server side handler responded to a request from /0:0:0:0:0:0:0:1:47536
[2025-08-01T22:33:43.898Z] Issuing request(2) http://[::1]:36389/ GET
[2025-08-01T22:33:43.898Z] Http2TestContext::handle Http2TestExchangeImpl: Http2TestExchangeImpl@77c6c39b
[2025-08-01T22:33:43.898Z] Handling request http://[::1]:36389/ from /0:0:0:0:0:0:0:1:47536
[2025-08-01T22:33:43.898Z] Server side handler responded to a request from /0:0:0:0:0:0:0:1:47536
[2025-08-01T22:33:43.898Z] Issuing request(3) http://[::1]:36389/ GET
[2025-08-01T22:33:43.898Z] Http2TestContext::handle Http2TestExchangeImpl: Http2TestExchangeImpl@1dcfc23e
[2025-08-01T22:33:43.898Z] Handling request http://[::1]:36389/ from /0:0:0:0:0:0:0:1:47536
[2025-08-01T22:33:43.898Z] Server side handler responded to a request from /0:0:0:0:0:0:0:1:47536
[2025-08-01T22:33:43.898Z] Issuing request(4) http://[::1]:36389/ GET
[2025-08-01T22:33:43.898Z] Http2TestContext::handle Http2TestExchangeImpl: Http2TestExchangeImpl@73f949bb
[2025-08-01T22:33:43.898Z] Handling request http://[::1]:36389/ from /0:0:0:0:0:0:0:1:47536
[2025-08-01T22:33:43.898Z] Server side handler responded to a request from /0:0:0:0:0:0:0:1:47536
[2025-08-01T22:33:43.898Z] Issuing request(5) http://[::1]:36389/ GET
[2025-08-01T22:33:43.898Z] Http2TestContext::handle Http2TestExchangeImpl: Http2TestExchangeImpl@11cf883a
[2025-08-01T22:33:43.898Z] Handling request http://[::1]:36389/ from /0:0:0:0:0:0:0:1:47536
[2025-08-01T22:33:43.898Z] Server side handler responded to a request from /0:0:0:0:0:0:0:1:47536
[2025-08-01T22:33:43.898Z] PASSED: No outstanding operations found in 3 clients
[2025-08-01T22:33:43.898Z] Stopping server HttpServerAdapters$HttpTestServer$Http2TestServerImpl@3c3e15a5
[2025-08-01T22:33:43.898Z] Http2TestServerImpl: stop
[2025-08-01T22:33:43.898Z] Stopping server HttpServerAdapters$HttpTestServer$Http2TestServerImpl@196b22f5
[2025-08-01T22:33:43.898Z] Http2TestServerImpl: stop
[2025-08-01T22:33:43.898Z] STDERR:
[2025-08-01T22:33:43.898Z] IPSupport - IPv4: true
[2025-08-01T22:33:43.898Z] IPSupport - IPv6: true
[2025-08-01T22:33:43.898Z] preferIPv4Stack: false
[2025-08-01T22:33:43.898Z] preferIPv6Addresses: true
[2025-08-01T22:33:43.898Z] STARTED ConnectionReuseTest::testConnReuse '[1] https://localhost:60555/'
[2025-08-01T22:33:43.898Z] java.net.ConnectException: Connection refused
[2025-08-01T22:33:43.898Z] at java.net.http/jdk.internal.net.http.HttpClientImpl.send(HttpClientImpl.java:562)
[2025-08-01T22:33:43.898Z] at java.net.http/jdk.internal.net.http.HttpClientFacade.send(HttpClientFacade.java:119)
[2025-08-01T22:33:43.898Z] at ConnectionReuseTest.testConnReuse(ConnectionReuseTest.java:147)
[2025-08-01T22:33:43.898Z] at java.base/jdk.internal.reflect.NativeMethodAccessorImpl.invoke0(Native Method)
[2025-08-01T22:33:43.898Z] at java.base/jdk.internal.reflect.NativeMethodAccessorImpl.invoke(NativeMethodAccessorImpl.java:62)
[2025-08-01T22:33:43.898Z] at java.base/jdk.internal.reflect.DelegatingMethodAccessorImpl.invoke(DelegatingMethodAccessorImpl.java:43)
[2025-08-01T22:33:43.898Z] at java.base/java.lang.reflect.Method.invoke(Method.java:566)
[2025-08-01T22:33:43.898Z] at org.junit.platform.commons.util.ReflectionUtils.invokeMethod(ReflectionUtils.java:727)
[2025-08-01T22:33:43.898Z] at org.junit.jupiter.engine.execution.MethodInvocation.proceed(MethodInvocation.java:60)
[2025-08-01T22:33:43.898Z] at org.junit.jupiter.engine.execution.InvocationInterceptorChain$ValidatingInvocation.proceed(InvocationInterceptorChain.java:131)
[2025-08-01T22:33:43.898Z] at org.junit.jupiter.engine.extension.TimeoutExtension.intercept(TimeoutExtension.java:156)
[2025-08-01T22:33:43.898Z] at org.junit.jupiter.engine.extension.TimeoutExtension.interceptTestableMethod(TimeoutExtension.java:147)
[2025-08-01T22:33:43.898Z] at org.junit.jupiter.engine.extension.TimeoutExtension.interceptTestTemplateMethod(TimeoutExtension.java:94)
[2025-08-01T22:33:43.898Z] at org.junit.jupiter.engine.execution.InterceptingExecutableInvoker$ReflectiveInterceptorCall.lambda$ofVoidMethod$0(InterceptingExecutableInvoker.java:103)
[2025-08-01T22:33:43.898Z] at org.junit.jupiter.engine.execution.InterceptingExecutableInvoker.lambda$invoke$0(InterceptingExecutableInvoker.java:93)
[2025-08-01T22:33:43.898Z] at org.junit.jupiter.engine.execution.InvocationInterceptorChain$InterceptedInvocation.proceed(InvocationInterceptorChain.java:106)
[2025-08-01T22:33:43.898Z] at org.junit.jupiter.engine.execution.InvocationInterceptorChain.proceed(InvocationInterceptorChain.java:64)
[2025-08-01T22:33:43.898Z] at org.junit.jupiter.engine.execution.InvocationInterceptorChain.chainAndInvoke(InvocationInterceptorChain.java:45)
[2025-08-01T22:33:43.898Z] at org.junit.jupiter.engine.execution.InvocationInterceptorChain.invoke(InvocationInterceptorChain.java:37)
[2025-08-01T22:33:43.898Z] at org.junit.jupiter.engine.execution.InterceptingExecutableInvoker.invoke(InterceptingExecutableInvoker.java:92)
[2025-08-01T22:33:43.898Z] at org.junit.jupiter.engine.execution.InterceptingExecutableInvoker.invoke(InterceptingExecutableInvoker.java:86)
[2025-08-01T22:33:43.898Z] at org.junit.jupiter.engine.descriptor.TestMethodTestDescriptor.lambda$invokeTestMethod$7(TestMethodTestDescriptor.java:217)
[2025-08-01T22:33:43.898Z] at org.junit.platform.engine.support.hierarchical.ThrowableCollector.execute(ThrowableCollector.java:73)
[2025-08-01T22:33:43.898Z] at org.junit.jupiter.engine.descriptor.TestMethodTestDescriptor.invokeTestMethod(TestMethodTestDescriptor.java:213)
[2025-08-01T22:33:43.898Z] at org.junit.jupiter.engine.descriptor.TestMethodTestDescriptor.execute(TestMethodTestDescriptor.java:138)
[2025-08-01T22:33:43.898Z] at org.junit.jupiter.engine.descriptor.TestMethodTestDescriptor.execute(TestMethodTestDescriptor.java:68)
[2025-08-01T22:33:43.900Z] at org.junit.platform.engine.support.hierarchical.NodeTestTask.lambda$executeRecursively$6(NodeTestTask.java:151)
[2025-08-01T22:33:43.900Z] at org.junit.platform.engine.support.hierarchical.ThrowableCollector.execute(ThrowableCollector.java:73)
[2025-08-01T22:33:43.900Z] at org.junit.platform.engine.support.hierarchical.NodeTestTask.lambda$executeRecursively$8(NodeTestTask.java:141)
[2025-08-01T22:33:43.900Z] at org.junit.platform.engine.support.hierarchical.Node.around(Node.java:137)
[2025-08-01T22:33:43.900Z] at org.junit.platform.engine.support.hierarchical.NodeTestTask.lambda$executeRecursively$9(NodeTestTask.java:139)
[2025-08-01T22:33:43.900Z] at org.junit.platform.engine.support.hierarchical.ThrowableCollector.execute(ThrowableCollector.java:73)
[2025-08-01T22:33:43.900Z] at org.junit.platform.engine.support.hierarchical.NodeTestTask.executeRecursively(NodeTestTask.java:138)
[2025-08-01T22:33:43.900Z] at org.junit.platform.engine.support.hierarchical.NodeTestTask.execute(NodeTestTask.java:95)
[2025-08-01T22:33:43.900Z] at org.junit.platform.engine.support.hierarchical.SameThreadHierarchicalTestExecutorService.submit(SameThreadHierarchicalTestExecutorService.java:35)
[2025-08-01T22:33:43.900Z] at org.junit.platform.engine.support.hierarchical.NodeTestTask$DefaultDynamicTestExecutor.execute(NodeTestTask.java:226)
[2025-08-01T22:33:43.900Z] at org.junit.platform.engine.support.hierarchical.NodeTestTask$DefaultDynamicTestExecutor.execute(NodeTestTask.java:204)
[2025-08-01T22:33:43.900Z] at org.junit.jupiter.engine.descriptor.TestTemplateTestDescriptor.execute(TestTemplateTestDescriptor.java:142)
[2025-08-01T22:33:43.900Z] at org.junit.jupiter.engine.descriptor.TestTemplateTestDescriptor.lambda$execute$2(TestTemplateTestDescriptor.java:110)
[2025-08-01T22:33:43.900Z] at java.base/java.util.stream.ForEachOps$ForEachOp$OfRef.accept(ForEachOps.java:183)
[2025-08-01T22:33:43.900Z] at java.base/java.util.stream.ReferencePipeline$3$1.accept(ReferencePipeline.java:195)
[2025-08-01T22:33:43.900Z] at java.base/java.util.stream.ReferencePipeline$2$1.accept(ReferencePipeline.java:177)
[2025-08-01T22:33:43.900Z] at java.base/java.util.stream.ReferencePipeline$3$1.accept(ReferencePipeline.java:195)
[2025-08-01T22:33:43.900Z] at java.base/java.util.stream.ForEachOps$ForEachOp$OfRef.accept(ForEachOps.java:183)
[2025-08-01T22:33:43.900Z] at java.base/java.util.stream.ReferencePipeline$3$1.accept(ReferencePipeline.java:195)
[2025-08-01T22:33:43.900Z] at java.base/java.util.stream.ReferencePipeline$3$1.accept(ReferencePipeline.java:195)
[2025-08-01T22:33:43.900Z] at java.base/java.util.stream.ReferencePipeline$3$1.accept(ReferencePipeline.java:195)
[2025-08-01T22:33:43.900Z] at java.base/java.util.stream.ForEachOps$ForEachOp$OfRef.accept(ForEachOps.java:183)
[2025-08-01T22:33:43.900Z] at java.base/java.util.stream.ReferencePipeline$3$1.accept(ReferencePipeline.java:195)
[2025-08-01T22:33:43.900Z] at java.base/java.util.ArrayList$ArrayListSpliterator.forEachRemaining(ArrayList.java:1655)
[2025-08-01T22:33:43.900Z] at java.base/java.util.stream.ReferencePipeline$Head.forEach(ReferencePipeline.java:658)
[2025-08-01T22:33:43.900Z] at java.base/java.util.stream.ReferencePipeline$7$1.accept(ReferencePipeline.java:274)
[2025-08-01T22:33:43.900Z] at java.base/java.util.stream.ReferencePipeline$3$1.accept(ReferencePipeline.java:195)
[2025-08-01T22:33:43.900Z] at java.base/java.util.stream.ReferencePipeline$3$1.accept(ReferencePipeline.java:195)
[2025-08-01T22:33:43.900Z] at java.base/java.util.Spliterators$ArraySpliterator.forEachRemaining(Spliterators.java:948)
[2025-08-01T22:33:43.900Z] at java.base/java.util.stream.AbstractPipeline.copyInto(AbstractPipeline.java:484)
[2025-08-01T22:33:43.900Z] at java.base/java.util.stream.AbstractPipeline.wrapAndCopyInto(AbstractPipeline.java:474)
[2025-08-01T22:33:43.900Z] at java.base/java.util.stream.ForEachOps$ForEachOp.evaluateSequential(ForEachOps.java:150)
[2025-08-01T22:33:43.900Z] at java.base/java.util.stream.ForEachOps$ForEachOp$OfRef.evaluateSequential(ForEachOps.java:173)
[2025-08-01T22:33:43.900Z] at java.base/java.util.stream.AbstractPipeline.evaluate(AbstractPipeline.java:234)
[2025-08-01T22:33:43.900Z] at java.base/java.util.stream.ReferencePipeline.forEach(ReferencePipeline.java:497)
[2025-08-01T22:33:43.900Z] at java.base/java.util.stream.ReferencePipeline$7$1.accept(ReferencePipeline.java:274)
[2025-08-01T22:33:43.900Z] at java.base/java.util.stream.ReferencePipeline$3$1.accept(ReferencePipeline.java:195)
[2025-08-01T22:33:43.900Z] at java.base/java.util.stream.ReferencePipeline$3$1.accept(ReferencePipeline.java:195)
[2025-08-01T22:33:43.900Z] at java.base/java.util.stream.ReferencePipeline$3$1.accept(ReferencePipeline.java:195)
[2025-08-01T22:33:43.900Z] at java.base/java.util.ArrayList$ArrayListSpliterator.forEachRemaining(ArrayList.java:1655)
[2025-08-01T22:33:43.900Z] at java.base/java.util.stream.AbstractPipeline.copyInto(AbstractPipeline.java:484)
[2025-08-01T22:33:43.900Z] at java.base/java.util.stream.AbstractPipeline.wrapAndCopyInto(AbstractPipeline.java:474)
[2025-08-01T22:33:43.900Z] at java.base/java.util.stream.ForEachOps$ForEachOp.evaluateSequential(ForEachOps.java:150)
[2025-08-01T22:33:43.900Z] at java.base/java.util.stream.ForEachOps$ForEachOp$OfRef.evaluateSequential(ForEachOps.java:173)
[2025-08-01T22:33:43.900Z] at java.base/java.util.stream.AbstractPipeline.evaluate(AbstractPipeline.java:234)
[2025-08-01T22:33:43.900Z] at java.base/java.util.stream.ReferencePipeline.forEach(ReferencePipeline.java:497)
[2025-08-01T22:33:43.900Z] at java.base/java.util.stream.ReferencePipeline$7$1.accept(ReferencePipeline.java:274)
[2025-08-01T22:33:43.900Z] at java.base/java.util.ArrayList$ArrayListSpliterator.forEachRemaining(ArrayList.java:1655)
[2025-08-01T22:33:43.900Z] at java.base/java.util.stream.AbstractPipeline.copyInto(AbstractPipeline.java:484)
[2025-08-01T22:33:43.900Z] at java.base/java.util.stream.AbstractPipeline.wrapAndCopyInto(AbstractPipeline.java:474)
[2025-08-01T22:33:43.900Z] at java.base/java.util.stream.ForEachOps$ForEachOp.evaluateSequential(ForEachOps.java:150)
[2025-08-01T22:33:43.901Z] at java.base/java.util.stream.ForEachOps$ForEachOp$OfRef.evaluateSequential(ForEachOps.java:173)
[2025-08-01T22:33:43.901Z] at java.base/java.util.stream.AbstractPipeline.evaluate(AbstractPipeline.java:234)
[2025-08-01T22:33:43.901Z] at java.base/java.util.stream.ReferencePipeline.forEach(ReferencePipeline.java:497)
[2025-08-01T22:33:43.901Z] at org.junit.jupiter.engine.descriptor.TestTemplateTestDescriptor.execute(TestTemplateTestDescriptor.java:110)
[2025-08-01T22:33:43.901Z] at org.junit.jupiter.engine.descriptor.TestTemplateTestDescriptor.execute(TestTemplateTestDescriptor.java:44)
[2025-08-01T22:33:43.901Z] at org.junit.platform.engine.support.hierarchical.NodeTestTask.lambda$executeRecursively$6(NodeTestTask.java:151)
[2025-08-01T22:33:43.901Z] at org.junit.platform.engine.support.hierarchical.ThrowableCollector.execute(ThrowableCollector.java:73)
[2025-08-01T22:33:43.901Z] at org.junit.platform.engine.support.hierarchical.NodeTestTask.lambda$executeRecursively$8(NodeTestTask.java:141)
[2025-08-01T22:33:43.901Z] at org.junit.platform.engine.support.hierarchical.Node.around(Node.java:137)
[2025-08-01T22:33:43.901Z] at org.junit.platform.engine.support.hierarchical.NodeTestTask.lambda$executeRecursively$9(NodeTestTask.java:139)
[2025-08-01T22:33:43.901Z] at org.junit.platform.engine.support.hierarchical.ThrowableCollector.execute(ThrowableCollector.java:73)
[2025-08-01T22:33:43.901Z] at org.junit.platform.engine.support.hierarchical.NodeTestTask.executeRecursively(NodeTestTask.java:138)
[2025-08-01T22:33:43.901Z] at org.junit.platform.engine.support.hierarchical.NodeTestTask.execute(NodeTestTask.java:95)
[2025-08-01T22:33:43.901Z] at java.base/java.util.ArrayList.forEach(ArrayList.java:1541)
[2025-08-01T22:33:43.901Z] at org.junit.platform.engine.support.hierarchical.SameThreadHierarchicalTestExecutorService.invokeAll(SameThreadHierarchicalTestExecutorService.java:41)
[2025-08-01T22:33:43.901Z] at org.junit.platform.engine.support.hierarchical.NodeTestTask.lambda$executeRecursively$6(NodeTestTask.java:155)
[2025-08-01T22:33:43.901Z] at org.junit.platform.engine.support.hierarchical.ThrowableCollector.execute(ThrowableCollector.java:73)
[2025-08-01T22:33:43.901Z] at org.junit.platform.engine.support.hierarchical.NodeTestTask.lambda$executeRecursively$8(NodeTestTask.java:141)
[2025-08-01T22:33:43.901Z] at org.junit.platform.engine.support.hierarchical.Node.around(Node.java:137)
[2025-08-01T22:33:43.901Z] at org.junit.platform.engine.support.hierarchical.NodeTestTask.lambda$executeRecursively$9(NodeTestTask.java:139)
[2025-08-01T22:33:43.901Z] at org.junit.platform.engine.support.hierarchical.ThrowableCollector.execute(ThrowableCollector.java:73)
[2025-08-01T22:33:43.901Z] at org.junit.platform.engine.support.hierarchical.NodeTestTask.executeRecursively(NodeTestTask.java:138)
[2025-08-01T22:33:43.901Z] at org.junit.platform.engine.support.hierarchical.NodeTestTask.execute(NodeTestTask.java:95)
[2025-08-01T22:33:43.901Z] at java.base/java.util.ArrayList.forEach(ArrayList.java:1541)
[2025-08-01T22:33:43.901Z] at org.junit.platform.engine.support.hierarchical.SameThreadHierarchicalTestExecutorService.invokeAll(SameThreadHierarchicalTestExecutorService.java:41)
[2025-08-01T22:33:43.901Z] at org.junit.platform.engine.support.hierarchical.NodeTestTask.lambda$executeRecursively$6(NodeTestTask.java:155)
[2025-08-01T22:33:43.901Z] at org.junit.platform.engine.support.hierarchical.ThrowableCollector.execute(ThrowableCollector.java:73)
[2025-08-01T22:33:43.901Z] at org.junit.platform.engine.support.hierarchical.NodeTestTask.lambda$executeRecursively$8(NodeTestTask.java:141)
[2025-08-01T22:33:43.901Z] at org.junit.platform.engine.support.hierarchical.Node.around(Node.java:137)
[2025-08-01T22:33:43.901Z] at org.junit.platform.engine.support.hierarchical.NodeTestTask.lambda$executeRecursively$9(NodeTestTask.java:139)
[2025-08-01T22:33:43.901Z] at org.junit.platform.engine.support.hierarchical.ThrowableCollector.execute(ThrowableCollector.java:73)
[2025-08-01T22:33:43.901Z] at org.junit.platform.engine.support.hierarchical.NodeTestTask.executeRecursively(NodeTestTask.java:138)
[2025-08-01T22:33:43.901Z] at org.junit.platform.engine.support.hierarchical.NodeTestTask.execute(NodeTestTask.java:95)
[2025-08-01T22:33:43.901Z] at org.junit.platform.engine.support.hierarchical.SameThreadHierarchicalTestExecutorService.submit(SameThreadHierarchicalTestExecutorService.java:35)
[2025-08-01T22:33:43.901Z] at org.junit.platform.engine.support.hierarchical.HierarchicalTestExecutor.execute(HierarchicalTestExecutor.java:57)
[2025-08-01T22:33:43.901Z] at org.junit.platform.engine.support.hierarchical.HierarchicalTestEngine.execute(HierarchicalTestEngine.java:54)
[2025-08-01T22:33:43.901Z] at org.junit.platform.launcher.core.EngineExecutionOrchestrator.execute(EngineExecutionOrchestrator.java:147)
[2025-08-01T22:33:43.901Z] at org.junit.platform.launcher.core.EngineExecutionOrchestrator.execute(EngineExecutionOrchestrator.java:127)
[2025-08-01T22:33:43.901Z] at org.junit.platform.launcher.core.EngineExecutionOrchestrator.execute(EngineExecutionOrchestrator.java:90)
[2025-08-01T22:33:43.901Z] at org.junit.platform.launcher.core.EngineExecutionOrchestrator.lambda$execute$0(EngineExecutionOrchestrator.java:55)
[2025-08-01T22:33:43.901Z] at org.junit.platform.launcher.core.EngineExecutionOrchestrator.withInterceptedStreams(EngineExecutionOrchestrator.java:102)
[2025-08-01T22:33:43.901Z] at org.junit.platform.launcher.core.EngineExecutionOrchestrator.execute(EngineExecutionOrchestrator.java:54)
[2025-08-01T22:33:43.901Z] at org.junit.platform.launcher.core.DefaultLauncher.execute(DefaultLauncher.java:114)
[2025-08-01T22:33:43.901Z] at org.junit.platform.launcher.core.DefaultLauncher.execute(DefaultLauncher.java:86)
[2025-08-01T22:33:43.901Z] at org.junit.platform.launcher.core.DefaultLauncherSession$DelegatingLauncher.execute(DefaultLauncherSession.java:86)
[2025-08-01T22:33:43.901Z] at com.sun.javatest.regtest.agent.JUnitRunner.runWithJUnitPlatform(JUnitRunner.java:142)
[2025-08-01T22:33:43.901Z] at com.sun.javatest.regtest.agent.JUnitRunner.main(JUnitRunner.java:95)
[2025-08-01T22:33:43.901Z] at com.sun.javatest.regtest.agent.JUnitRunner.main(JUnitRunner.java:61)
[2025-08-01T22:33:43.901Z] at java.base/jdk.internal.reflect.NativeMethodAccessorImpl.invoke0(Native Method)
[2025-08-01T22:33:43.901Z] at java.base/jdk.internal.reflect.NativeMethodAccessorImpl.invoke(NativeMethodAccessorImpl.java:62)
[2025-08-01T22:33:43.901Z] at java.base/jdk.internal.reflect.DelegatingMethodAccessorImpl.invoke(DelegatingMethodAccessorImpl.java:43)
[2025-08-01T22:33:43.901Z] at java.base/java.lang.reflect.Method.invoke(Method.java:566)
[2025-08-01T22:33:43.901Z] at com.sun.javatest.regtest.agent.MainWrapper$MainTask.run(MainWrapper.java:138)
[2025-08-01T22:33:43.901Z] at java.base/java.lang.Thread.run(Thread.java:829)
[2025-08-01T22:33:43.901Z] Caused by: java.net.ConnectException: Connection refused
[2025-08-01T22:33:43.901Z] at java.base/sun.nio.ch.SocketChannelImpl.checkConnect(Native Method)
[2025-08-01T22:33:43.901Z] at java.base/sun.nio.ch.SocketChannelImpl.finishConnect(SocketChannelImpl.java:777)
[2025-08-01T22:33:43.901Z] at java.net.http/jdk.internal.net.http.PlainHttpConnection$ConnectEvent.handle(PlainHttpConnection.java:128)
[2025-08-01T22:33:43.901Z] at java.net.http/jdk.internal.net.http.HttpClientImpl$SelectorManager.handleEvent(HttpClientImpl.java:962)
[2025-08-01T22:33:43.901Z] at java.net.http/jdk.internal.net.http.HttpClientImpl$SelectorManager.lambda$run$3(HttpClientImpl.java:917)
[2025-08-01T22:33:43.901Z] at java.base/java.util.ArrayList.forEach(ArrayList.java:1541)
[2025-08-01T22:33:43.901Z] at java.net.http/jdk.internal.net.http.HttpClientImpl$SelectorManager.run(HttpClientImpl.java:917)
[2025-08-01T22:33:43.901Z] FAILED ConnectionReuseTest::testConnReuse '[1] https://localhost:60555/'
[2025-08-01T22:33:43.901Z] STARTED ConnectionReuseTest::testConnReuse '[2] http://localhost:36389/'
[2025-08-01T22:33:43.901Z] java.net.ConnectException: Connection refused
[2025-08-01T22:33:43.901Z] at java.net.http/jdk.internal.net.http.HttpClientImpl.send(HttpClientImpl.java:562)
[2025-08-01T22:33:43.901Z] at java.net.http/jdk.internal.net.http.HttpClientFacade.send(HttpClientFacade.java:119)
[2025-08-01T22:33:43.901Z] at ConnectionReuseTest.testConnReuse(ConnectionReuseTest.java:147)
[2025-08-01T22:33:43.901Z] at java.base/jdk.internal.reflect.NativeMethodAccessorImpl.invoke0(Native Method)
[2025-08-01T22:33:43.901Z] at java.base/jdk.internal.reflect.NativeMethodAccessorImpl.invoke(NativeMethodAccessorImpl.java:62)
[2025-08-01T22:33:43.901Z] at java.base/jdk.internal.reflect.DelegatingMethodAccessorImpl.invoke(DelegatingMethodAccessorImpl.java:43)
[2025-08-01T22:33:43.901Z] at java.base/java.lang.reflect.Method.invoke(Method.java:566)
[2025-08-01T22:33:43.901Z] at org.junit.platform.commons.util.ReflectionUtils.invokeMethod(ReflectionUtils.java:727)
[2025-08-01T22:33:43.901Z] at org.junit.jupiter.engine.execution.MethodInvocation.proceed(MethodInvocation.java:60)
[2025-08-01T22:33:43.901Z] at org.junit.jupiter.engine.execution.InvocationInterceptorChain$ValidatingInvocation.proceed(InvocationInterceptorChain.java:131)
[2025-08-01T22:33:43.901Z] at org.junit.jupiter.engine.extension.TimeoutExtension.intercept(TimeoutExtension.java:156)
[2025-08-01T22:33:43.901Z] at org.junit.jupiter.engine.extension.TimeoutExtension.interceptTestableMethod(TimeoutExtension.java:147)
[2025-08-01T22:33:43.901Z] at org.junit.jupiter.engine.extension.TimeoutExtension.interceptTestTemplateMethod(TimeoutExtension.java:94)
[2025-08-01T22:33:43.901Z] at org.junit.jupiter.engine.execution.InterceptingExecutableInvoker$ReflectiveInterceptorCall.lambda$ofVoidMethod$0(InterceptingExecutableInvoker.java:103)
[2025-08-01T22:33:43.902Z] at org.junit.jupiter.engine.execution.InterceptingExecutableInvoker.lambda$invoke$0(InterceptingExecutableInvoker.java:93)
[2025-08-01T22:33:43.902Z] at org.junit.jupiter.engine.execution.InvocationInterceptorChain$InterceptedInvocation.proceed(InvocationInterceptorChain.java:106)
[2025-08-01T22:33:43.902Z] at org.junit.jupiter.engine.execution.InvocationInterceptorChain.proceed(InvocationInterceptorChain.java:64)
[2025-08-01T22:33:43.902Z] at org.junit.jupiter.engine.execution.InvocationInterceptorChain.chainAndInvoke(InvocationInterceptorChain.java:45)
[2025-08-01T22:33:43.902Z] at org.junit.jupiter.engine.execution.InvocationInterceptorChain.invoke(InvocationInterceptorChain.java:37)
[2025-08-01T22:33:43.902Z] at org.junit.jupiter.engine.execution.InterceptingExecutableInvoker.invoke(InterceptingExecutableInvoker.java:92)
[2025-08-01T22:33:43.902Z] at org.junit.jupiter.engine.execution.InterceptingExecutableInvoker.invoke(InterceptingExecutableInvoker.java:86)
[2025-08-01T22:33:43.902Z] at org.junit.jupiter.engine.descriptor.TestMethodTestDescriptor.lambda$invokeTestMethod$7(TestMethodTestDescriptor.java:217)
[2025-08-01T22:33:43.902Z] at org.junit.platform.engine.support.hierarchical.ThrowableCollector.execute(ThrowableCollector.java:73)
[2025-08-01T22:33:43.902Z] at org.junit.jupiter.engine.descriptor.TestMethodTestDescriptor.invokeTestMethod(TestMethodTestDescriptor.java:213)
[2025-08-01T22:33:43.902Z] at org.junit.jupiter.engine.descriptor.TestMethodTestDescriptor.execute(TestMethodTestDescriptor.java:138)
[2025-08-01T22:33:43.902Z] at org.junit.jupiter.engine.descriptor.TestMethodTestDescriptor.execute(TestMethodTestDescriptor.java:68)
[2025-08-01T22:33:43.902Z] at org.junit.platform.engine.support.hierarchical.NodeTestTask.lambda$executeRecursively$6(NodeTestTask.java:151)
[2025-08-01T22:33:43.902Z] at org.junit.platform.engine.support.hierarchical.ThrowableCollector.execute(ThrowableCollector.java:73)
[2025-08-01T22:33:43.902Z] at org.junit.platform.engine.support.hierarchical.NodeTestTask.lambda$executeRecursively$8(NodeTestTask.java:141)
[2025-08-01T22:33:43.902Z] at org.junit.platform.engine.support.hierarchical.Node.around(Node.java:137)
[2025-08-01T22:33:43.902Z] at org.junit.platform.engine.support.hierarchical.NodeTestTask.lambda$executeRecursively$9(NodeTestTask.java:139)
[2025-08-01T22:33:43.902Z] at org.junit.platform.engine.support.hierarchical.ThrowableCollector.execute(ThrowableCollector.java:73)
[2025-08-01T22:33:43.902Z] at org.junit.platform.engine.support.hierarchical.NodeTestTask.executeRecursively(NodeTestTask.java:138)
[2025-08-01T22:33:43.902Z] at org.junit.platform.engine.support.hierarchical.NodeTestTask.execute(NodeTestTask.java:95)
[2025-08-01T22:33:43.902Z] at org.junit.platform.engine.support.hierarchical.SameThreadHierarchicalTestExecutorService.submit(SameThreadHierarchicalTestExecutorService.java:35)
[2025-08-01T22:33:43.902Z] at org.junit.platform.engine.support.hierarchical.NodeTestTask$DefaultDynamicTestExecutor.execute(NodeTestTask.java:226)
[2025-08-01T22:33:43.902Z] at org.junit.platform.engine.support.hierarchical.NodeTestTask$DefaultDynamicTestExecutor.execute(NodeTestTask.java:204)
[2025-08-01T22:33:43.902Z] at org.junit.jupiter.engine.descriptor.TestTemplateTestDescriptor.execute(TestTemplateTestDescriptor.java:142)
[2025-08-01T22:33:43.902Z] at org.junit.jupiter.engine.descriptor.TestTemplateTestDescriptor.lambda$execute$2(TestTemplateTestDescriptor.java:110)
[2025-08-01T22:33:43.902Z] at java.base/java.util.stream.ForEachOps$ForEachOp$OfRef.accept(ForEachOps.java:183)
[2025-08-01T22:33:43.902Z] at java.base/java.util.stream.ReferencePipeline$3$1.accept(ReferencePipeline.java:195)
[2025-08-01T22:33:43.902Z] at java.base/java.util.stream.ReferencePipeline$2$1.accept(ReferencePipeline.java:177)
[2025-08-01T22:33:43.902Z] at java.base/java.util.stream.ReferencePipeline$3$1.accept(ReferencePipeline.java:195)
[2025-08-01T22:33:43.902Z] at java.base/java.util.stream.ForEachOps$ForEachOp$OfRef.accept(ForEachOps.java:183)
[2025-08-01T22:33:43.902Z] at java.base/java.util.stream.ReferencePipeline$3$1.accept(ReferencePipeline.java:195)
[2025-08-01T22:33:43.902Z] at java.base/java.util.stream.ReferencePipeline$3$1.accept(ReferencePipeline.java:195)
[2025-08-01T22:33:43.902Z] at java.base/java.util.stream.ReferencePipeline$3$1.accept(ReferencePipeline.java:195)
[2025-08-01T22:33:43.902Z] at java.base/java.util.stream.ForEachOps$ForEachOp$OfRef.accept(ForEachOps.java:183)
[2025-08-01T22:33:43.902Z] at java.base/java.util.stream.ReferencePipeline$3$1.accept(ReferencePipeline.java:195)
[2025-08-01T22:33:43.902Z] at java.base/java.util.ArrayList$ArrayListSpliterator.forEachRemaining(ArrayList.java:1655)
[2025-08-01T22:33:43.902Z] at java.base/java.util.stream.ReferencePipeline$Head.forEach(ReferencePipeline.java:658)
[2025-08-01T22:33:43.902Z] at java.base/java.util.stream.ReferencePipeline$7$1.accept(ReferencePipeline.java:274)
[2025-08-01T22:33:43.902Z] at java.base/java.util.stream.ReferencePipeline$3$1.accept(ReferencePipeline.java:195)
[2025-08-01T22:33:43.902Z] at java.base/java.util.stream.ReferencePipeline$3$1.accept(ReferencePipeline.java:195)
[2025-08-01T22:33:43.902Z] at java.base/java.util.Spliterators$ArraySpliterator.forEachRemaining(Spliterators.java:948)
[2025-08-01T22:33:43.902Z] at java.base/java.util.stream.AbstractPipeline.copyInto(AbstractPipeline.java:484)
[2025-08-01T22:33:43.902Z] at java.base/java.util.stream.AbstractPipeline.wrapAndCopyInto(AbstractPipeline.java:474)
[2025-08-01T22:33:43.902Z] at java.base/java.util.stream.ForEachOps$ForEachOp.evaluateSequential(ForEachOps.java:150)
[2025-08-01T22:33:43.902Z] at java.base/java.util.stream.ForEachOps$ForEachOp$OfRef.evaluateSequential(ForEachOps.java:173)
[2025-08-01T22:33:43.902Z] at java.base/java.util.stream.AbstractPipeline.evaluate(AbstractPipeline.java:234)
[2025-08-01T22:33:43.902Z] at java.base/java.util.stream.ReferencePipeline.forEach(ReferencePipeline.java:497)
[2025-08-01T22:33:43.902Z] at java.base/java.util.stream.ReferencePipeline$7$1.accept(ReferencePipeline.java:274)
[2025-08-01T22:33:43.902Z] at java.base/java.util.stream.ReferencePipeline$3$1.accept(ReferencePipeline.java:195)
[2025-08-01T22:33:43.902Z] at java.base/java.util.stream.ReferencePipeline$3$1.accept(ReferencePipeline.java:195)
[2025-08-01T22:33:43.902Z] at java.base/java.util.stream.ReferencePipeline$3$1.accept(ReferencePipeline.java:195)
[2025-08-01T22:33:43.902Z] at java.base/java.util.ArrayList$ArrayListSpliterator.forEachRemaining(ArrayList.java:1655)
[2025-08-01T22:33:43.902Z] at java.base/java.util.stream.AbstractPipeline.copyInto(AbstractPipeline.java:484)
[2025-08-01T22:33:43.902Z] at java.base/java.util.stream.AbstractPipeline.wrapAndCopyInto(AbstractPipeline.java:474)
[2025-08-01T22:33:43.902Z] at java.base/java.util.stream.ForEachOps$ForEachOp.evaluateSequential(ForEachOps.java:150)
[2025-08-01T22:33:43.902Z] at java.base/java.util.stream.ForEachOps$ForEachOp$OfRef.evaluateSequential(ForEachOps.java:173)
[2025-08-01T22:33:43.902Z] at java.base/java.util.stream.AbstractPipeline.evaluate(AbstractPipeline.java:234)
[2025-08-01T22:33:43.902Z] at java.base/java.util.stream.ReferencePipeline.forEach(ReferencePipeline.java:497)
[2025-08-01T22:33:43.902Z] at java.base/java.util.stream.ReferencePipeline$7$1.accept(ReferencePipeline.java:274)
[2025-08-01T22:33:43.902Z] at java.base/java.util.ArrayList$ArrayListSpliterator.forEachRemaining(ArrayList.java:1655)
[2025-08-01T22:33:43.902Z] at java.base/java.util.stream.AbstractPipeline.copyInto(AbstractPipeline.java:484)
[2025-08-01T22:33:43.902Z] at java.base/java.util.stream.AbstractPipeline.wrapAndCopyInto(AbstractPipeline.java:474)
[2025-08-01T22:33:43.902Z] at java.base/java.util.stream.ForEachOps$ForEachOp.evaluateSequential(ForEachOps.java:150)
[2025-08-01T22:33:43.902Z] at java.base/java.util.stream.ForEachOps$ForEachOp$OfRef.evaluateSequential(ForEachOps.java:173)
[2025-08-01T22:33:43.902Z] at java.base/java.util.stream.AbstractPipeline.evaluate(AbstractPipeline.java:234)
[2025-08-01T22:33:43.902Z] at java.base/java.util.stream.ReferencePipeline.forEach(ReferencePipeline.java:497)
[2025-08-01T22:33:43.902Z] at org.junit.jupiter.engine.descriptor.TestTemplateTestDescriptor.execute(TestTemplateTestDescriptor.java:110)
[2025-08-01T22:33:43.902Z] at org.junit.jupiter.engine.descriptor.TestTemplateTestDescriptor.execute(TestTemplateTestDescriptor.java:44)
[2025-08-01T22:33:43.903Z] at org.junit.platform.engine.support.hierarchical.NodeTestTask.lambda$executeRecursively$6(NodeTestTask.java:151)
[2025-08-01T22:33:43.903Z] at org.junit.platform.engine.support.hierarchical.ThrowableCollector.execute(ThrowableCollector.java:73)
[2025-08-01T22:33:43.903Z] at org.junit.platform.engine.support.hierarchical.NodeTestTask.lambda$executeRecursively$8(NodeTestTask.java:141)
[2025-08-01T22:33:43.903Z] at org.junit.platform.engine.support.hierarchical.Node.around(Node.java:137)
[2025-08-01T22:33:43.903Z] at org.junit.platform.engine.support.hierarchical.NodeTestTask.lambda$executeRecursively$9(NodeTestTask.java:139)
[2025-08-01T22:33:43.903Z] at org.junit.platform.engine.support.hierarchical.ThrowableCollector.execute(ThrowableCollector.java:73)
[2025-08-01T22:33:43.903Z] at org.junit.platform.engine.support.hierarchical.NodeTestTask.executeRecursively(NodeTestTask.java:138)
[2025-08-01T22:33:43.903Z] at org.junit.platform.engine.support.hierarchical.NodeTestTask.execute(NodeTestTask.java:95)
[2025-08-01T22:33:43.903Z] at java.base/java.util.ArrayList.forEach(ArrayList.java:1541)
[2025-08-01T22:33:43.903Z] at org.junit.platform.engine.support.hierarchical.SameThreadHierarchicalTestExecutorService.invokeAll(SameThreadHierarchicalTestExecutorService.java:41)
[2025-08-01T22:33:43.903Z] at org.junit.platform.engine.support.hierarchical.NodeTestTask.lambda$executeRecursively$6(NodeTestTask.java:155)
[2025-08-01T22:33:43.903Z] at org.junit.platform.engine.support.hierarchical.ThrowableCollector.execute(ThrowableCollector.java:73)
[2025-08-01T22:33:43.903Z] at org.junit.platform.engine.support.hierarchical.NodeTestTask.lambda$executeRecursively$8(NodeTestTask.java:141)
[2025-08-01T22:33:43.903Z] at org.junit.platform.engine.support.hierarchical.Node.around(Node.java:137)
[2025-08-01T22:33:43.903Z] at org.junit.platform.engine.support.hierarchical.NodeTestTask.lambda$executeRecursively$9(NodeTestTask.java:139)
[2025-08-01T22:33:43.903Z] at org.junit.platform.engine.support.hierarchical.ThrowableCollector.execute(ThrowableCollector.java:73)
[2025-08-01T22:33:43.903Z] at org.junit.platform.engine.support.hierarchical.NodeTestTask.executeRecursively(NodeTestTask.java:138)
[2025-08-01T22:33:43.903Z] at org.junit.platform.engine.support.hierarchical.NodeTestTask.execute(NodeTestTask.java:95)
[2025-08-01T22:33:43.903Z] at java.base/java.util.ArrayList.forEach(ArrayList.java:1541)
[2025-08-01T22:33:43.903Z] at org.junit.platform.engine.support.hierarchical.SameThreadHierarchicalTestExecutorService.invokeAll(SameThreadHierarchicalTestExecutorService.java:41)
[2025-08-01T22:33:43.903Z] at org.junit.platform.engine.support.hierarchical.NodeTestTask.lambda$executeRecursively$6(NodeTestTask.java:155)
[2025-08-01T22:33:43.903Z] at org.junit.platform.engine.support.hierarchical.ThrowableCollector.execute(ThrowableCollector.java:73)
[2025-08-01T22:33:43.903Z] at org.junit.platform.engine.support.hierarchical.NodeTestTask.lambda$executeRecursively$8(NodeTestTask.java:141)
[2025-08-01T22:33:43.903Z] at org.junit.platform.engine.support.hierarchical.Node.around(Node.java:137)
[2025-08-01T22:33:43.903Z] at org.junit.platform.engine.support.hierarchical.NodeTestTask.lambda$executeRecursively$9(NodeTestTask.java:139)
[2025-08-01T22:33:43.903Z] at org.junit.platform.engine.support.hierarchical.ThrowableCollector.execute(ThrowableCollector.java:73)
[2025-08-01T22:33:43.903Z] at org.junit.platform.engine.support.hierarchical.NodeTestTask.executeRecursively(NodeTestTask.java:138)
[2025-08-01T22:33:43.903Z] at org.junit.platform.engine.support.hierarchical.NodeTestTask.execute(NodeTestTask.java:95)
[2025-08-01T22:33:43.903Z] at org.junit.platform.engine.support.hierarchical.SameThreadHierarchicalTestExecutorService.submit(SameThreadHierarchicalTestExecutorService.java:35)
[2025-08-01T22:33:43.903Z] at org.junit.platform.engine.support.hierarchical.HierarchicalTestExecutor.execute(HierarchicalTestExecutor.java:57)
[2025-08-01T22:33:43.903Z] at org.junit.platform.engine.support.hierarchical.HierarchicalTestEngine.execute(HierarchicalTestEngine.java:54)
[2025-08-01T22:33:43.903Z] at org.junit.platform.launcher.core.EngineExecutionOrchestrator.execute(EngineExecutionOrchestrator.java:147)
[2025-08-01T22:33:43.903Z] at org.junit.platform.launcher.core.EngineExecutionOrchestrator.execute(EngineExecutionOrchestrator.java:127)
[2025-08-01T22:33:43.903Z] at org.junit.platform.launcher.core.EngineExecutionOrchestrator.execute(EngineExecutionOrchestrator.java:90)
[2025-08-01T22:33:43.903Z] at org.junit.platform.launcher.core.EngineExecutionOrchestrator.lambda$execute$0(EngineExecutionOrchestrator.java:55)
[2025-08-01T22:33:43.903Z] at org.junit.platform.launcher.core.EngineExecutionOrchestrator.withInterceptedStreams(EngineExecutionOrchestrator.java:102)
[2025-08-01T22:33:43.903Z] at org.junit.platform.launcher.core.EngineExecutionOrchestrator.execute(EngineExecutionOrchestrator.java:54)
[2025-08-01T22:33:43.903Z] at org.junit.platform.launcher.core.DefaultLauncher.execute(DefaultLauncher.java:114)
[2025-08-01T22:33:43.903Z] at org.junit.platform.launcher.core.DefaultLauncher.execute(DefaultLauncher.java:86)
[2025-08-01T22:33:43.903Z] at org.junit.platform.launcher.core.DefaultLauncherSession$DelegatingLauncher.execute(DefaultLauncherSession.java:86)
[2025-08-01T22:33:43.903Z] at com.sun.javatest.regtest.agent.JUnitRunner.runWithJUnitPlatform(JUnitRunner.java:142)
[2025-08-01T22:33:43.903Z] at com.sun.javatest.regtest.agent.JUnitRunner.main(JUnitRunner.java:95)
[2025-08-01T22:33:43.903Z] at com.sun.javatest.regtest.agent.JUnitRunner.main(JUnitRunner.java:61)
[2025-08-01T22:33:43.903Z] at java.base/jdk.internal.reflect.NativeMethodAccessorImpl.invoke0(Native Method)
[2025-08-01T22:33:43.903Z] at java.base/jdk.internal.reflect.NativeMethodAccessorImpl.invoke(NativeMethodAccessorImpl.java:62)
[2025-08-01T22:33:43.903Z] at java.base/jdk.internal.reflect.DelegatingMethodAccessorImpl.invoke(DelegatingMethodAccessorImpl.java:43)
[2025-08-01T22:33:43.903Z] at java.base/java.lang.reflect.Method.invoke(Method.java:566)
[2025-08-01T22:33:43.903Z] at com.sun.javatest.regtest.agent.MainWrapper$MainTask.run(MainWrapper.java:138)
[2025-08-01T22:33:43.903Z] at java.base/java.lang.Thread.run(Thread.java:829)
[2025-08-01T22:33:43.903Z] Caused by: java.net.ConnectException: Connection refused
[2025-08-01T22:33:43.903Z] at java.base/sun.nio.ch.SocketChannelImpl.checkConnect(Native Method)
[2025-08-01T22:33:43.903Z] at java.base/sun.nio.ch.SocketChannelImpl.finishConnect(SocketChannelImpl.java:777)
[2025-08-01T22:33:43.903Z] at java.net.http/jdk.internal.net.http.PlainHttpConnection$ConnectEvent.handle(PlainHttpConnection.java:128)
[2025-08-01T22:33:43.903Z] at java.net.http/jdk.internal.net.http.HttpClientImpl$SelectorManager.handleEvent(HttpClientImpl.java:962)
[2025-08-01T22:33:43.903Z] at java.net.http/jdk.internal.net.http.HttpClientImpl$SelectorManager.lambda$run$3(HttpClientImpl.java:917)
[2025-08-01T22:33:43.903Z] at java.base/java.util.ArrayList.forEach(ArrayList.java:1541)
[2025-08-01T22:33:43.903Z] at java.net.http/jdk.internal.net.http.HttpClientImpl$SelectorManager.run(HttpClientImpl.java:917)
[2025-08-01T22:33:43.903Z] FAILED ConnectionReuseTest::testConnReuse '[2] http://localhost:36389/'
[2025-08-01T22:33:43.903Z] STARTED ConnectionReuseTest::testConnReuse '[3] http://[::1]:36389/'
[2025-08-01T22:33:43.903Z] TestServer: New connection from Socket[addr=/0:0:0:0:0:0:0:1,port=47536,localport=36389]
[2025-08-01T22:33:43.903Z] TestServer: GET /
[2025-08-01T22:33:43.903Z] Server: creating input stream for stream 1
[2025-08-01T22:33:43.903Z] Using handler for: /
[2025-08-01T22:33:43.903Z] Sent response headers 200
[2025-08-01T22:33:43.903Z] TestServer: GET /
[2025-08-01T22:33:43.903Z] Server: got END_STREAM for stream 3
[2025-08-01T22:33:43.903Z] Using handler for: /
[2025-08-01T22:33:43.903Z] Sent response headers 200
[2025-08-01T22:33:43.903Z] TestServer: GET /
[2025-08-01T22:33:43.903Z] Server: got END_STREAM for stream 5
[2025-08-01T22:33:43.903Z] Using handler for: /
[2025-08-01T22:33:43.903Z] Sent response headers 200
[2025-08-01T22:33:43.903Z] TestServer: GET /
[2025-08-01T22:33:43.903Z] Server: got END_STREAM for stream 7
[2025-08-01T22:33:43.903Z] Using handler for: /
[2025-08-01T22:33:43.903Z] Sent response headers 200
[2025-08-01T22:33:43.903Z] TestServer: GET /
[2025-08-01T22:33:43.903Z] Server: got END_STREAM for stream 9
[2025-08-01T22:33:43.903Z] Using handler for: /
[2025-08-01T22:33:43.903Z] Sent response headers 200
[2025-08-01T22:33:43.903Z] SUCCESSFUL ConnectionReuseTest::testConnReuse '[3] http://[::1]:36389/'
[2025-08-01T22:33:43.903Z] Server stopping 0 connections
[2025-08-01T22:33:43.903Z] Server stopping 1 connections
[2025-08-01T22:33:43.903Z] Server connection to /0:0:0:0:0:0:0:1:47536 stopping. 5 streams
[2025-08-01T22:33:43.903Z] TestServer: Connection writer stopping
[2025-08-01T22:33:43.903Z] JavaTest Message: JUnit Platform Failure(s): 2
[2025-08-01T22:33:43.903Z]
[2025-08-01T22:33:43.903Z] [ JUnit Containers: found 5, started 5, succeeded 5, failed 0, aborted 0, skipped 0]
[2025-08-01T22:33:43.903Z] [ JUnit Tests: found 3, started 3, succeeded 1, failed 2, aborted 0, skipped 0]
[2025-08-01T22:33:43.903Z]
[2025-08-01T22:33:43.903Z] java.lang.Exception: JUnit test failure
[2025-08-01T22:33:43.903Z] at com.sun.javatest.regtest.agent.JUnitRunner.runWithJUnitPlatform(JUnitRunner.java:149)
[2025-08-01T22:33:43.903Z] at com.sun.javatest.regtest.agent.JUnitRunner.main(JUnitRunner.java:95)
[2025-08-01T22:33:43.903Z] at com.sun.javatest.regtest.agent.JUnitRunner.main(JUnitRunner.java:61)
[2025-08-01T22:33:43.903Z] at java.base/jdk.internal.reflect.NativeMethodAccessorImpl.invoke0(Native Method)
[2025-08-01T22:33:43.903Z] at java.base/jdk.internal.reflect.NativeMethodAccessorImpl.invoke(NativeMethodAccessorImpl.java:62)
[2025-08-01T22:33:43.903Z] at java.base/jdk.internal.reflect.DelegatingMethodAccessorImpl.invoke(DelegatingMethodAccessorImpl.java:43)
[2025-08-01T22:33:43.903Z] at java.base/java.lang.reflect.Method.invoke(Method.java:566)
[2025-08-01T22:33:43.903Z] at com.sun.javatest.regtest.agent.MainWrapper$MainTask.run(MainWrapper.java:138)
[2025-08-01T22:33:43.903Z] at java.base/java.lang.Thread.run(Thread.java:829)
[2025-08-01T22:33:43.903Z]
[2025-08-01T22:33:43.903Z] JavaTest Message: Test threw exception: java.lang.Exception: JUnit test failure
[2025-08-01T22:33:43.903Z] JavaTest Message: shutting down test
[2025-08-01T22:33:43.903Z]
[2025-08-01T22:33:43.903Z] STATUS:Failed.`main' threw exception: java.lang.Exception: JUnit test failure
[2025-08-01T22:33:43.903Z] rerun:
[2025-08-01T22:33:43.903Z] cd /home/jenkins/workspace/Test_openjdk11_hs_extended.openjdk_s390x_linux_testList_2/aqa-tests/TKG/output_1754086839279/jdk_net_1/work/scratch && \
[2025-08-01T22:33:43.903Z] DBUS_SESSION_BUS_ADDRESS=unix:path=/run/user/1002/bus \
[2025-08-01T22:33:43.903Z] DISPLAY=:0 \
[2025-08-01T22:33:43.903Z] HOME=/home/jenkins \
[2025-08-01T22:33:43.903Z] LANG=C.UTF-8 \
[2025-08-01T22:33:43.903Z] PATH=/bin:/usr/bin:/usr/sbin \
[2025-08-01T22:33:43.904Z] XDG_RUNTIME_DIR=/run/user/1002 \
[2025-08-01T22:33:43.904Z] XDG_SESSION_CLASS=user \
[2025-08-01T22:33:43.904Z] XDG_SESSION_ID=1195 \
[2025-08-01T22:33:43.904Z] XDG_SESSION_TYPE=tty \
[2025-08-01T22:33:43.904Z] CLASSPATH=/home/jenkins/workspace/Test_openjdk11_hs_extended.openjdk_s390x_linux_testList_2/aqa-tests/TKG/output_1754086839279/jdk_net_1/work/classes/java/net/httpclient/http2/ConnectionReuseTest.d:/home/jenkins/workspace/Test_openjdk11_hs_extended.openjdk_s390x_linux_testList_2/aqa-tests/openjdk/openjdk-jdk/test/jdk/java/net/httpclient/http2:/home/jenkins/workspace/Test_openjdk11_hs_extended.openjdk_s390x_linux_testList_2/aqa-tests/TKG/output_1754086839279/jdk_net_1/work/classes/test/lib:/home/jenkins/workspace/Test_openjdk11_hs_extended.openjdk_s390x_linux_testList_2/aqa-tests/openjdk/openjdk-jdk/test/lib:/home/jenkins/workspace/Test_openjdk11_hs_extended.openjdk_s390x_linux_testList_2/aqa-tests/TKG/output_1754086839279/jdk_net_1/work/classes/java/net/httpclient/http2/server:/home/jenkins/workspace/Test_openjdk11_hs_extended.openjdk_s390x_linux_testList_2/aqa-tests/openjdk/openjdk-jdk/test/jdk/java/net/httpclient/http2/server:/home/jenkins/workspace/Test_openjdk11_hs_extended.openjdk_s390x_linux_testList_2/aqa-tests/TKG/output_1754086839279/jdk_net_1/work/classes/java/net/httpclient:/home/jenkins/workspace/Test_openjdk11_hs_extended.openjdk_s390x_linux_testList_2/aqa-tests/openjdk/openjdk-jdk/test/jdk/java/net/httpclient:/home/jenkins/workspace/Test_openjdk11_hs_extended.openjdk_s390x_linux_testList_2/jvmtest/openjdk/jtreg/lib/junit-platform-console-standalone-1.9.2.jar:/home/jenkins/workspace/Test_openjdk11_hs_extended.openjdk_s390x_linux_testList_2/jvmtest/openjdk/jtreg/lib/javatest.jar:/home/jenkins/workspace/Test_openjdk11_hs_extended.openjdk_s390x_linux_testList_2/jvmtest/openjdk/jtreg/lib/jtreg.jar \
[2025-08-01T22:33:43.904Z] /home/jenkins/workspace/Test_openjdk11_hs_extended.openjdk_s390x_linux_testList_2/jdkbinary/j2sdk-image/bin/java \
[2025-08-01T22:33:43.904Z] -Dtest.vm.opts='-ea -esa -Xmx512m -XX:-UseCompressedOops' \
[2025-08-01T22:33:43.904Z] -Dtest.tool.vm.opts='-J-ea -J-esa -J-Xmx512m -J-XX:-UseCompressedOops' \
[2025-08-01T22:33:43.904Z] -Dtest.compiler.opts= \
[2025-08-01T22:33:43.904Z] -Dtest.java.opts= \
[2025-08-01T22:33:43.904Z] -Dtest.jdk=/home/jenkins/workspace/Test_openjdk11_hs_extended.openjdk_s390x_linux_testList_2/jdkbinary/j2sdk-image \
[2025-08-01T22:33:43.904Z] -Dcompile.jdk=/home/jenkins/workspace/Test_openjdk11_hs_extended.openjdk_s390x_linux_testList_2/jdkbinary/j2sdk-image \
[2025-08-01T22:33:43.904Z] -Dtest.timeout.factor=8.0 \
[2025-08-01T22:33:43.904Z] -Dtest.nativepath=/home/jenkins/workspace/Test_openjdk11_hs_extended.openjdk_s390x_linux_testList_2/jdkbinary/openjdk-test-image/jdk/jtreg/native \
[2025-08-01T22:33:43.904Z] -Dtest.root=/home/jenkins/workspace/Test_openjdk11_hs_extended.openjdk_s390x_linux_testList_2/aqa-tests/openjdk/openjdk-jdk/test/jdk \
[2025-08-01T22:33:43.904Z] -Dtest.name=java/net/httpclient/http2/ConnectionReuseTest.java \
[2025-08-01T22:33:43.904Z] -Dtest.file=/home/jenkins/workspace/Test_openjdk11_hs_extended.openjdk_s390x_linux_testList_2/aqa-tests/openjdk/openjdk-jdk/test/jdk/java/net/httpclient/http2/ConnectionReuseTest.java \
[2025-08-01T22:33:43.904Z] -Dtest.src=/home/jenkins/workspace/Test_openjdk11_hs_extended.openjdk_s390x_linux_testList_2/aqa-tests/openjdk/openjdk-jdk/test/jdk/java/net/httpclient/http2 \
[2025-08-01T22:33:43.904Z] -Dtest.src.path=/home/jenkins/workspace/Test_openjdk11_hs_extended.openjdk_s390x_linux_testList_2/aqa-tests/openjdk/openjdk-jdk/test/jdk/java/net/httpclient/http2:/home/jenkins/workspace/Test_openjdk11_hs_extended.openjdk_s390x_linux_testList_2/aqa-tests/openjdk/openjdk-jdk/test/lib:/home/jenkins/workspace/Test_openjdk11_hs_extended.openjdk_s390x_linux_testList_2/aqa-tests/openjdk/openjdk-jdk/test/jdk/java/net/httpclient/http2/server:/home/jenkins/workspace/Test_openjdk11_hs_extended.openjdk_s390x_linux_testList_2/aqa-tests/openjdk/openjdk-jdk/test/jdk/java/net/httpclient \
[2025-08-01T22:33:43.904Z] -Dtest.classes=/home/jenkins/workspace/Test_openjdk11_hs_extended.openjdk_s390x_linux_testList_2/aqa-tests/TKG/output_1754086839279/jdk_net_1/work/classes/java/net/httpclient/http2/ConnectionReuseTest.d \
[2025-08-01T22:33:43.904Z] -Dtest.class.path=/home/jenkins/workspace/Test_openjdk11_hs_extended.openjdk_s390x_linux_testList_2/aqa-tests/TKG/output_1754086839279/jdk_net_1/work/classes/java/net/httpclient/http2/ConnectionReuseTest.d:/home/jenkins/workspace/Test_openjdk11_hs_extended.openjdk_s390x_linux_testList_2/aqa-tests/TKG/output_1754086839279/jdk_net_1/work/classes/test/lib:/home/jenkins/workspace/Test_openjdk11_hs_extended.openjdk_s390x_linux_testList_2/aqa-tests/TKG/output_1754086839279/jdk_net_1/work/classes/java/net/httpclient/http2/server:/home/jenkins/workspace/Test_openjdk11_hs_extended.openjdk_s390x_linux_testList_2/aqa-tests/TKG/output_1754086839279/jdk_net_1/work/classes/java/net/httpclient \
[2025-08-01T22:33:43.904Z] -Dtest.class.path.prefix=/home/jenkins/workspace/Test_openjdk11_hs_extended.openjdk_s390x_linux_testList_2/aqa-tests/TKG/output_1754086839279/jdk_net_1/work/classes/java/net/httpclient/http2/ConnectionReuseTest.d:/home/jenkins/workspace/Test_openjdk11_hs_extended.openjdk_s390x_linux_testList_2/aqa-tests/openjdk/openjdk-jdk/test/jdk/java/net/httpclient/http2:/home/jenkins/workspace/Test_openjdk11_hs_extended.openjdk_s390x_linux_testList_2/aqa-tests/TKG/output_1754086839279/jdk_net_1/work/classes/test/lib:/home/jenkins/workspace/Test_openjdk11_hs_extended.openjdk_s390x_linux_testList_2/aqa-tests/TKG/output_1754086839279/jdk_net_1/work/classes/java/net/httpclient/http2/server:/home/jenkins/workspace/Test_openjdk11_hs_extended.openjdk_s390x_linux_testList_2/aqa-tests/TKG/output_1754086839279/jdk_net_1/work/classes/java/net/httpclient \
[2025-08-01T22:33:43.904Z] -Dtest.modules='java.net.http/jdk.internal.net.http.common java.net.http/jdk.internal.net.http.frame java.net.http/jdk.internal.net.http.hpack java.logging java.base/sun.net.www.http java.base/sun.net.www java.base/sun.net' \
[2025-08-01T22:33:43.904Z] --add-modules java.net.http,java.logging,java.base \
[2025-08-01T22:33:43.904Z] --add-exports java.net.http/jdk.internal.net.http.common=ALL-UNNAMED \
[2025-08-01T22:33:43.904Z] --add-exports java.net.http/jdk.internal.net.http.frame=ALL-UNNAMED \
[2025-08-01T22:33:43.904Z] --add-exports java.net.http/jdk.internal.net.http.hpack=ALL-UNNAMED \
[2025-08-01T22:33:43.904Z] --add-exports java.base/sun.net.www.http=ALL-UNNAMED \
[2025-08-01T22:33:43.904Z] --add-exports java.base/sun.net.www=ALL-UNNAMED \
[2025-08-01T22:33:43.904Z] --add-exports java.base/sun.net=ALL-UNNAMED \
[2025-08-01T22:33:43.904Z] -ea \
[2025-08-01T22:33:43.904Z] -esa \
[2025-08-01T22:33:43.904Z] -Xmx512m \
[2025-08-01T22:33:43.904Z] -XX:-UseCompressedOops \
[2025-08-01T22:33:43.904Z] -Djava.library.path=/home/jenkins/workspace/Test_openjdk11_hs_extended.openjdk_s390x_linux_testList_2/jdkbinary/openjdk-test-image/jdk/jtreg/native \
[2025-08-01T22:33:43.904Z] -Djava.net.preferIPv6Addresses=true \
[2025-08-01T22:33:43.904Z] com.sun.javatest.regtest.agent.MainWrapper /home/jenkins/workspace/Test_openjdk11_hs_extended.openjdk_s390x_linux_testList_2/aqa-tests/TKG/output_1754086839279/jdk_net_1/work/java/net/httpclient/http2/ConnectionReuseTest.d/junit.1.jta java/net/httpclient/http2/ConnectionReuseTest.java ConnectionReuseTest
[2025-08-01T22:33:43.904Z]
[2025-08-01T22:33:43.904Z] TEST RESULT: Failed. Execution failed: `main' threw exception: java.lang.Exception: JUnit test failure
[2025-08-01T22:33:43.904Z] --------------------------------------------------
[2025-08-01T23:23:56.751Z] TEST: java/net/MulticastSocket/SetLoopbackModeIPv4.java
[2025-08-01T23:23:56.751Z] TEST JDK: /home/jenkins/workspace/Test_openjdk11_hs_extended.openjdk_s390x_linux_testList_2/jdkbinary/j2sdk-image
[2025-08-01T23:23:56.751Z]
[2025-08-01T23:23:56.751Z] ACTION: build -- Passed. Build successful
[2025-08-01T23:23:56.752Z] REASON: User specified action: run build jdk.test.lib.NetworkConfiguration jdk.test.lib.Platform SetLoopbackMode SetLoopbackModeIPv4
[2025-08-01T23:23:56.752Z] TIME: 0.068 seconds
[2025-08-01T23:23:56.752Z] messages:
[2025-08-01T23:23:56.752Z] command: build jdk.test.lib.NetworkConfiguration jdk.test.lib.Platform SetLoopbackMode SetLoopbackModeIPv4
[2025-08-01T23:23:56.752Z] reason: User specified action: run build jdk.test.lib.NetworkConfiguration jdk.test.lib.Platform SetLoopbackMode SetLoopbackModeIPv4
[2025-08-01T23:23:56.752Z] started: Fri Aug 01 23:23:53 UTC 2025
[2025-08-01T23:23:56.752Z] Test directory:
[2025-08-01T23:23:56.752Z] compile: SetLoopbackMode, SetLoopbackModeIPv4
[2025-08-01T23:23:56.752Z] finished: Fri Aug 01 23:23:53 UTC 2025
[2025-08-01T23:23:56.752Z] elapsed time (seconds): 0.068
[2025-08-01T23:23:56.752Z]
[2025-08-01T23:23:56.752Z] ACTION: compile -- Passed. Compilation successful
[2025-08-01T23:23:56.752Z] REASON: .class file out of date or does not exist
[2025-08-01T23:23:56.752Z] TIME: 0.067 seconds
[2025-08-01T23:23:56.752Z] messages:
[2025-08-01T23:23:56.752Z] command: compile /home/jenkins/workspace/Test_openjdk11_hs_extended.openjdk_s390x_linux_testList_2/aqa-tests/openjdk/openjdk-jdk/test/jdk/java/net/MulticastSocket/SetLoopbackMode.java /home/jenkins/workspace/Test_openjdk11_hs_extended.openjdk_s390x_linux_testList_2/aqa-tests/openjdk/openjdk-jdk/test/jdk/java/net/MulticastSocket/SetLoopbackModeIPv4.java
[2025-08-01T23:23:56.752Z] reason: .class file out of date or does not exist
[2025-08-01T23:23:56.752Z] started: Fri Aug 01 23:23:53 UTC 2025
[2025-08-01T23:23:56.752Z] Mode: agentvm
[2025-08-01T23:23:56.752Z] Agent id: 1
[2025-08-01T23:23:56.752Z] finished: Fri Aug 01 23:23:53 UTC 2025
[2025-08-01T23:23:56.752Z] elapsed time (seconds): 0.067
[2025-08-01T23:23:56.752Z] configuration:
[2025-08-01T23:23:56.752Z] Boot Layer (javac runtime environment)
[2025-08-01T23:23:56.752Z] class path: /home/jenkins/workspace/Test_openjdk11_hs_extended.openjdk_s390x_linux_testList_2/jvmtest/openjdk/jtreg/lib/javatest.jar
[2025-08-01T23:23:56.752Z] /home/jenkins/workspace/Test_openjdk11_hs_extended.openjdk_s390x_linux_testList_2/jvmtest/openjdk/jtreg/lib/jtreg.jar
[2025-08-01T23:23:56.752Z] patch: java.base /home/jenkins/workspace/Test_openjdk11_hs_extended.openjdk_s390x_linux_testList_2/aqa-tests/TKG/output_1754086839279/jdk_net_1/work/patches/java.base
[2025-08-01T23:23:56.752Z]
[2025-08-01T23:23:56.752Z] javac compilation environment
[2025-08-01T23:23:56.752Z] source path: /home/jenkins/workspace/Test_openjdk11_hs_extended.openjdk_s390x_linux_testList_2/aqa-tests/openjdk/openjdk-jdk/test/jdk/java/net/MulticastSocket
[2025-08-01T23:23:56.752Z] /home/jenkins/workspace/Test_openjdk11_hs_extended.openjdk_s390x_linux_testList_2/aqa-tests/openjdk/openjdk-jdk/test/lib
[2025-08-01T23:23:56.752Z] class path: /home/jenkins/workspace/Test_openjdk11_hs_extended.openjdk_s390x_linux_testList_2/aqa-tests/openjdk/openjdk-jdk/test/jdk/java/net/MulticastSocket
[2025-08-01T23:23:56.752Z] /home/jenkins/workspace/Test_openjdk11_hs_extended.openjdk_s390x_linux_testList_2/aqa-tests/TKG/output_1754086839279/jdk_net_1/work/classes/java/net/MulticastSocket/SetLoopbackModeIPv4.d
[2025-08-01T23:23:56.752Z] /home/jenkins/workspace/Test_openjdk11_hs_extended.openjdk_s390x_linux_testList_2/aqa-tests/TKG/output_1754086839279/jdk_net_1/work/classes/test/lib
[2025-08-01T23:23:56.752Z]
[2025-08-01T23:23:56.752Z] rerun:
[2025-08-01T23:23:56.752Z] cd /home/jenkins/workspace/Test_openjdk11_hs_extended.openjdk_s390x_linux_testList_2/aqa-tests/TKG/output_1754086839279/jdk_net_1/work/scratch && \
[2025-08-01T23:23:56.752Z] DBUS_SESSION_BUS_ADDRESS=unix:path=/run/user/1002/bus \
[2025-08-01T23:23:56.752Z] DISPLAY=:0 \
[2025-08-01T23:23:56.752Z] HOME=/home/jenkins \
[2025-08-01T23:23:56.752Z] LANG=C.UTF-8 \
[2025-08-01T23:23:56.752Z] PATH=/bin:/usr/bin:/usr/sbin \
[2025-08-01T23:23:56.752Z] XDG_RUNTIME_DIR=/run/user/1002 \
[2025-08-01T23:23:56.752Z] XDG_SESSION_CLASS=user \
[2025-08-01T23:23:56.752Z] XDG_SESSION_ID=1195 \
[2025-08-01T23:23:56.752Z] XDG_SESSION_TYPE=tty \
[2025-08-01T23:23:56.752Z] /home/jenkins/workspace/Test_openjdk11_hs_extended.openjdk_s390x_linux_testList_2/jdkbinary/j2sdk-image/bin/javac \
[2025-08-01T23:23:56.752Z] -J-ea \
[2025-08-01T23:23:56.752Z] -J-esa \
[2025-08-01T23:23:56.752Z] -J-Xmx512m \
[2025-08-01T23:23:56.752Z] -J-XX:-UseCompressedOops \
[2025-08-01T23:23:56.752Z] -J-Dtest.vm.opts='-ea -esa -Xmx512m -XX:-UseCompressedOops' \
[2025-08-01T23:23:56.752Z] -J-Dtest.tool.vm.opts='-J-ea -J-esa -J-Xmx512m -J-XX:-UseCompressedOops' \
[2025-08-01T23:23:56.752Z] -J-Dtest.compiler.opts= \
[2025-08-01T23:23:56.752Z] -J-Dtest.java.opts= \
[2025-08-01T23:23:56.752Z] -J-Dtest.jdk=/home/jenkins/workspace/Test_openjdk11_hs_extended.openjdk_s390x_linux_testList_2/jdkbinary/j2sdk-image \
[2025-08-01T23:23:56.752Z] -J-Dcompile.jdk=/home/jenkins/workspace/Test_openjdk11_hs_extended.openjdk_s390x_linux_testList_2/jdkbinary/j2sdk-image \
[2025-08-01T23:23:56.752Z] -J-Dtest.timeout.factor=8.0 \
[2025-08-01T23:23:56.752Z] -J-Dtest.nativepath=/home/jenkins/workspace/Test_openjdk11_hs_extended.openjdk_s390x_linux_testList_2/jdkbinary/openjdk-test-image/jdk/jtreg/native \
[2025-08-01T23:23:56.752Z] -J-Dtest.root=/home/jenkins/workspace/Test_openjdk11_hs_extended.openjdk_s390x_linux_testList_2/aqa-tests/openjdk/openjdk-jdk/test/jdk \
[2025-08-01T23:23:56.752Z] -J-Dtest.name=java/net/MulticastSocket/SetLoopbackModeIPv4.java \
[2025-08-01T23:23:56.752Z] -J-Dtest.file=/home/jenkins/workspace/Test_openjdk11_hs_extended.openjdk_s390x_linux_testList_2/aqa-tests/openjdk/openjdk-jdk/test/jdk/java/net/MulticastSocket/SetLoopbackModeIPv4.java \
[2025-08-01T23:23:56.752Z] -J-Dtest.src=/home/jenkins/workspace/Test_openjdk11_hs_extended.openjdk_s390x_linux_testList_2/aqa-tests/openjdk/openjdk-jdk/test/jdk/java/net/MulticastSocket \
[2025-08-01T23:23:56.752Z] -J-Dtest.src.path=/home/jenkins/workspace/Test_openjdk11_hs_extended.openjdk_s390x_linux_testList_2/aqa-tests/openjdk/openjdk-jdk/test/jdk/java/net/MulticastSocket:/home/jenkins/workspace/Test_openjdk11_hs_extended.openjdk_s390x_linux_testList_2/aqa-tests/openjdk/openjdk-jdk/test/lib \
[2025-08-01T23:23:56.752Z] -J-Dtest.classes=/home/jenkins/workspace/Test_openjdk11_hs_extended.openjdk_s390x_linux_testList_2/aqa-tests/TKG/output_1754086839279/jdk_net_1/work/classes/java/net/MulticastSocket/SetLoopbackModeIPv4.d \
[2025-08-01T23:23:56.752Z] -J-Dtest.class.path=/home/jenkins/workspace/Test_openjdk11_hs_extended.openjdk_s390x_linux_testList_2/aqa-tests/TKG/output_1754086839279/jdk_net_1/work/classes/java/net/MulticastSocket/SetLoopbackModeIPv4.d:/home/jenkins/workspace/Test_openjdk11_hs_extended.openjdk_s390x_linux_testList_2/aqa-tests/TKG/output_1754086839279/jdk_net_1/work/classes/test/lib \
[2025-08-01T23:23:56.752Z] -J-Dtest.class.path.prefix=/home/jenkins/workspace/Test_openjdk11_hs_extended.openjdk_s390x_linux_testList_2/aqa-tests/TKG/output_1754086839279/jdk_net_1/work/classes/java/net/MulticastSocket/SetLoopbackModeIPv4.d:/home/jenkins/workspace/Test_openjdk11_hs_extended.openjdk_s390x_linux_testList_2/aqa-tests/openjdk/openjdk-jdk/test/jdk/java/net/MulticastSocket:/home/jenkins/workspace/Test_openjdk11_hs_extended.openjdk_s390x_linux_testList_2/aqa-tests/TKG/output_1754086839279/jdk_net_1/work/classes/test/lib \
[2025-08-01T23:23:56.752Z] -d /home/jenkins/workspace/Test_openjdk11_hs_extended.openjdk_s390x_linux_testList_2/aqa-tests/TKG/output_1754086839279/jdk_net_1/work/classes/java/net/MulticastSocket/SetLoopbackModeIPv4.d \
[2025-08-01T23:23:56.752Z] -sourcepath /home/jenkins/workspace/Test_openjdk11_hs_extended.openjdk_s390x_linux_testList_2/aqa-tests/openjdk/openjdk-jdk/test/jdk/java/net/MulticastSocket:/home/jenkins/workspace/Test_openjdk11_hs_extended.openjdk_s390x_linux_testList_2/aqa-tests/openjdk/openjdk-jdk/test/lib \
[2025-08-01T23:23:56.753Z] -classpath /home/jenkins/workspace/Test_openjdk11_hs_extended.openjdk_s390x_linux_testList_2/aqa-tests/openjdk/openjdk-jdk/test/jdk/java/net/MulticastSocket:/home/jenkins/workspace/Test_openjdk11_hs_extended.openjdk_s390x_linux_testList_2/aqa-tests/TKG/output_1754086839279/jdk_net_1/work/classes/java/net/MulticastSocket/SetLoopbackModeIPv4.d:/home/jenkins/workspace/Test_openjdk11_hs_extended.openjdk_s390x_linux_testList_2/aqa-tests/TKG/output_1754086839279/jdk_net_1/work/classes/test/lib /home/jenkins/workspace/Test_openjdk11_hs_extended.openjdk_s390x_linux_testList_2/aqa-tests/openjdk/openjdk-jdk/test/jdk/java/net/MulticastSocket/SetLoopbackMode.java /home/jenkins/workspace/Test_openjdk11_hs_extended.openjdk_s390x_linux_testList_2/aqa-tests/openjdk/openjdk-jdk/test/jdk/java/net/MulticastSocket/SetLoopbackModeIPv4.java
[2025-08-01T23:23:56.753Z]
[2025-08-01T23:23:56.753Z] ACTION: build -- Passed. All files up to date
[2025-08-01T23:23:56.753Z] REASON: Named class compiled on demand
[2025-08-01T23:23:56.753Z] TIME: 0.0 seconds
[2025-08-01T23:23:56.753Z] messages:
[2025-08-01T23:23:56.753Z] command: build SetLoopbackModeIPv4
[2025-08-01T23:23:56.753Z] reason: Named class compiled on demand
[2025-08-01T23:23:56.753Z] started: Fri Aug 01 23:23:53 UTC 2025
[2025-08-01T23:23:56.753Z] finished: Fri Aug 01 23:23:53 UTC 2025
[2025-08-01T23:23:56.753Z] elapsed time (seconds): 0.0
[2025-08-01T23:23:56.753Z]
[2025-08-01T23:23:56.753Z] ACTION: main -- Failed. Execution failed: `main' threw exception: java.lang.RuntimeException: Test failed
[2025-08-01T23:23:56.753Z] REASON: User specified action: run main/othervm -Djava.net.preferIPv4Stack=true SetLoopbackModeIPv4
[2025-08-01T23:23:56.753Z] TIME: 2.304 seconds
[2025-08-01T23:23:56.753Z] messages:
[2025-08-01T23:23:56.753Z] command: main -Djava.net.preferIPv4Stack=true SetLoopbackModeIPv4
[2025-08-01T23:23:56.753Z] reason: User specified action: run main/othervm -Djava.net.preferIPv4Stack=true SetLoopbackModeIPv4
[2025-08-01T23:23:56.753Z] started: Fri Aug 01 23:23:53 UTC 2025
[2025-08-01T23:23:56.753Z] Mode: othervm [/othervm specified]
[2025-08-01T23:23:56.753Z] finished: Fri Aug 01 23:23:55 UTC 2025
[2025-08-01T23:23:56.753Z] elapsed time (seconds): 2.304
[2025-08-01T23:23:56.753Z] configuration:
[2025-08-01T23:23:56.753Z] STDOUT:
[2025-08-01T23:23:56.753Z]
[2025-08-01T23:23:56.753Z] Test will use multicast group: /224.80.80.80
[2025-08-01T23:23:56.753Z]
[2025-08-01T23:23:56.753Z] ******************
[2025-08-01T23:23:56.753Z]
[2025-08-01T23:23:56.753Z] Loopback mode is disabled.
[2025-08-01T23:23:56.753Z] Packet not received - correct.
[2025-08-01T23:23:56.753Z]
[2025-08-01T23:23:56.753Z] ******************
[2025-08-01T23:23:56.753Z]
[2025-08-01T23:23:56.753Z] Loopback mode is enabled.
[2025-08-01T23:23:56.753Z] Packet not received (packet excepted as loopback is enabled)
[2025-08-01T23:23:56.753Z]
[2025-08-01T23:23:56.753Z] ******************
[2025-08-01T23:23:56.753Z]
[2025-08-01T23:23:56.753Z] STDERR:
[2025-08-01T23:23:56.753Z] java.lang.RuntimeException: Test failed
[2025-08-01T23:23:56.753Z] at SetLoopbackMode.main(SetLoopbackMode.java:133)
[2025-08-01T23:23:56.753Z] at SetLoopbackModeIPv4.main(SetLoopbackModeIPv4.java:41)
[2025-08-01T23:23:56.753Z] at java.base/jdk.internal.reflect.NativeMethodAccessorImpl.invoke0(Native Method)
[2025-08-01T23:23:56.753Z] at java.base/jdk.internal.reflect.NativeMethodAccessorImpl.invoke(NativeMethodAccessorImpl.java:62)
[2025-08-01T23:23:56.753Z] at java.base/jdk.internal.reflect.DelegatingMethodAccessorImpl.invoke(DelegatingMethodAccessorImpl.java:43)
[2025-08-01T23:23:56.753Z] at java.base/java.lang.reflect.Method.invoke(Method.java:566)
[2025-08-01T23:23:56.753Z] at com.sun.javatest.regtest.agent.MainWrapper$MainTask.run(MainWrapper.java:138)
[2025-08-01T23:23:56.753Z] at java.base/java.lang.Thread.run(Thread.java:829)
[2025-08-01T23:23:56.753Z]
[2025-08-01T23:23:56.753Z] JavaTest Message: Test threw exception: java.lang.RuntimeException: Test failed
[2025-08-01T23:23:56.753Z] JavaTest Message: shutting down test
[2025-08-01T23:23:56.753Z]
[2025-08-01T23:23:56.753Z] STATUS:Failed.`main' threw exception: java.lang.RuntimeException: Test failed
[2025-08-01T23:23:56.753Z] rerun:
[2025-08-01T23:23:56.753Z] cd /home/jenkins/workspace/Test_openjdk11_hs_extended.openjdk_s390x_linux_testList_2/aqa-tests/TKG/output_1754086839279/jdk_net_1/work/scratch && \
[2025-08-01T23:23:56.753Z] DBUS_SESSION_BUS_ADDRESS=unix:path=/run/user/1002/bus \
[2025-08-01T23:23:56.753Z] DISPLAY=:0 \
[2025-08-01T23:23:56.753Z] HOME=/home/jenkins \
[2025-08-01T23:23:56.753Z] LANG=C.UTF-8 \
[2025-08-01T23:23:56.753Z] PATH=/bin:/usr/bin:/usr/sbin \
[2025-08-01T23:23:56.753Z] XDG_RUNTIME_DIR=/run/user/1002 \
[2025-08-01T23:23:56.753Z] XDG_SESSION_CLASS=user \
[2025-08-01T23:23:56.753Z] XDG_SESSION_ID=1195 \
[2025-08-01T23:23:56.753Z] XDG_SESSION_TYPE=tty \
[2025-08-01T23:23:56.753Z] CLASSPATH=/home/jenkins/workspace/Test_openjdk11_hs_extended.openjdk_s390x_linux_testList_2/aqa-tests/TKG/output_1754086839279/jdk_net_1/work/classes/java/net/MulticastSocket/SetLoopbackModeIPv4.d:/home/jenkins/workspace/Test_openjdk11_hs_extended.openjdk_s390x_linux_testList_2/aqa-tests/openjdk/openjdk-jdk/test/jdk/java/net/MulticastSocket:/home/jenkins/workspace/Test_openjdk11_hs_extended.openjdk_s390x_linux_testList_2/aqa-tests/TKG/output_1754086839279/jdk_net_1/work/classes/test/lib:/home/jenkins/workspace/Test_openjdk11_hs_extended.openjdk_s390x_linux_testList_2/aqa-tests/openjdk/openjdk-jdk/test/lib:/home/jenkins/workspace/Test_openjdk11_hs_extended.openjdk_s390x_linux_testList_2/jvmtest/openjdk/jtreg/lib/javatest.jar:/home/jenkins/workspace/Test_openjdk11_hs_extended.openjdk_s390x_linux_testList_2/jvmtest/openjdk/jtreg/lib/jtreg.jar \
[2025-08-01T23:23:56.753Z] /home/jenkins/workspace/Test_openjdk11_hs_extended.openjdk_s390x_linux_testList_2/jdkbinary/j2sdk-image/bin/java \
[2025-08-01T23:23:56.753Z] -Dtest.vm.opts='-ea -esa -Xmx512m -XX:-UseCompressedOops' \
[2025-08-01T23:23:56.753Z] -Dtest.tool.vm.opts='-J-ea -J-esa -J-Xmx512m -J-XX:-UseCompressedOops' \
[2025-08-01T23:23:56.753Z] -Dtest.compiler.opts= \
[2025-08-01T23:23:56.753Z] -Dtest.java.opts= \
[2025-08-01T23:23:56.753Z] -Dtest.jdk=/home/jenkins/workspace/Test_openjdk11_hs_extended.openjdk_s390x_linux_testList_2/jdkbinary/j2sdk-image \
[2025-08-01T23:23:56.753Z] -Dcompile.jdk=/home/jenkins/workspace/Test_openjdk11_hs_extended.openjdk_s390x_linux_testList_2/jdkbinary/j2sdk-image \
[2025-08-01T23:23:56.753Z] -Dtest.timeout.factor=8.0 \
[2025-08-01T23:23:56.753Z] -Dtest.nativepath=/home/jenkins/workspace/Test_openjdk11_hs_extended.openjdk_s390x_linux_testList_2/jdkbinary/openjdk-test-image/jdk/jtreg/native \
[2025-08-01T23:23:56.753Z] -Dtest.root=/home/jenkins/workspace/Test_openjdk11_hs_extended.openjdk_s390x_linux_testList_2/aqa-tests/openjdk/openjdk-jdk/test/jdk \
[2025-08-01T23:23:56.753Z] -Dtest.name=java/net/MulticastSocket/SetLoopbackModeIPv4.java \
[2025-08-01T23:23:56.753Z] -Dtest.file=/home/jenkins/workspace/Test_openjdk11_hs_extended.openjdk_s390x_linux_testList_2/aqa-tests/openjdk/openjdk-jdk/test/jdk/java/net/MulticastSocket/SetLoopbackModeIPv4.java \
[2025-08-01T23:23:56.753Z] -Dtest.src=/home/jenkins/workspace/Test_openjdk11_hs_extended.openjdk_s390x_linux_testList_2/aqa-tests/openjdk/openjdk-jdk/test/jdk/java/net/MulticastSocket \
[2025-08-01T23:23:56.753Z] -Dtest.src.path=/home/jenkins/workspace/Test_openjdk11_hs_extended.openjdk_s390x_linux_testList_2/aqa-tests/openjdk/openjdk-jdk/test/jdk/java/net/MulticastSocket:/home/jenkins/workspace/Test_openjdk11_hs_extended.openjdk_s390x_linux_testList_2/aqa-tests/openjdk/openjdk-jdk/test/lib \
[2025-08-01T23:23:56.753Z] -Dtest.classes=/home/jenkins/workspace/Test_openjdk11_hs_extended.openjdk_s390x_linux_testList_2/aqa-tests/TKG/output_1754086839279/jdk_net_1/work/classes/java/net/MulticastSocket/SetLoopbackModeIPv4.d \
[2025-08-01T23:23:56.753Z] -Dtest.class.path=/home/jenkins/workspace/Test_openjdk11_hs_extended.openjdk_s390x_linux_testList_2/aqa-tests/TKG/output_1754086839279/jdk_net_1/work/classes/java/net/MulticastSocket/SetLoopbackModeIPv4.d:/home/jenkins/workspace/Test_openjdk11_hs_extended.openjdk_s390x_linux_testList_2/aqa-tests/TKG/output_1754086839279/jdk_net_1/work/classes/test/lib \
[2025-08-01T23:23:56.753Z] -Dtest.class.path.prefix=/home/jenkins/workspace/Test_openjdk11_hs_extended.openjdk_s390x_linux_testList_2/aqa-tests/TKG/output_1754086839279/jdk_net_1/work/classes/java/net/MulticastSocket/SetLoopbackModeIPv4.d:/home/jenkins/workspace/Test_openjdk11_hs_extended.openjdk_s390x_linux_testList_2/aqa-tests/openjdk/openjdk-jdk/test/jdk/java/net/MulticastSocket:/home/jenkins/workspace/Test_openjdk11_hs_extended.openjdk_s390x_linux_testList_2/aqa-tests/TKG/output_1754086839279/jdk_net_1/work/classes/test/lib \
[2025-08-01T23:23:56.753Z] -ea \
[2025-08-01T23:23:56.753Z] -esa \
[2025-08-01T23:23:56.753Z] -Xmx512m \
[2025-08-01T23:23:56.753Z] -XX:-UseCompressedOops \
[2025-08-01T23:23:56.753Z] -Djava.library.path=/home/jenkins/workspace/Test_openjdk11_hs_extended.openjdk_s390x_linux_testList_2/jdkbinary/openjdk-test-image/jdk/jtreg/native \
[2025-08-01T23:23:56.753Z] -Djava.net.preferIPv4Stack=true \
[2025-08-01T23:23:56.753Z] com.sun.javatest.regtest.agent.MainWrapper /home/jenkins/workspace/Test_openjdk11_hs_extended.openjdk_s390x_linux_testList_2/aqa-tests/TKG/output_1754086839279/jdk_net_1/work/java/net/MulticastSocket/SetLoopbackModeIPv4.d/main.0.jta
[2025-08-01T23:23:56.753Z]
[2025-08-01T23:23:56.753Z] TEST RESULT: Failed. Execution failed: `main' threw exception: java.lang.RuntimeException: Test failed
[2025-08-01T23:23:56.753Z] --------------------------------------------------
[2025-08-01T23:38:49.699Z] Test results: passed: 719; failed: 2
[2025-08-01T23:39:10.162Z] Report written to /home/jenkins/workspace/Test_openjdk11_hs_extended.openjdk_s390x_linux_testList_2/aqa-tests/TKG/output_1754086839279/jdk_net_1/report/html/report.html
[2025-08-01T23:39:10.162Z] Results written to /home/jenkins/workspace/Test_openjdk11_hs_extended.openjdk_s390x_linux_testList_2/aqa-tests/TKG/output_1754086839279/jdk_net_1/work
[2025-08-01T23:39:10.162Z] Error: Some tests failed or other problems occurred.
[2025-08-01T23:39:10.162Z] -----------------------------------
[2025-08-01T23:39:10.162Z] jdk_net_1_FAILED
[2025-08-01T23:39:10.162Z] -----------------------------------
[2025-08-01T23:39:10.162Z]
[2025-08-01T23:39:10.162Z] TEST TEARDOWN:
[2025-08-01T23:39:10.162Z] Nothing to be done for teardown.
[2025-08-01T23:39:10.162Z] jdk_net_1 Finish Time: Fri Aug 1 23:39:07 2025 Epoch Time (ms): 1754091547220