jdk_jfr_0
[2025-08-02T05:40:30.420Z] Running test jdk_jfr_0 ...
[2025-08-02T05:40:30.420Z] ===============================================
[2025-08-02T05:40:30.420Z] jdk_jfr_0 Start Time: Sat Aug 2 05:40:25 2025 Epoch Time (ms): 1754113225641
[2025-08-02T05:40:30.420Z] variation: Mode150
[2025-08-02T05:40:30.420Z] JVM_OPTIONS: -XX:+UseCompressedOops
[2025-08-02T05:40:30.420Z] { \
[2025-08-02T05:40:30.420Z] echo ""; echo "TEST SETUP:"; \
[2025-08-02T05:40:30.420Z] echo "Nothing to be done for setup."; \
[2025-08-02T05:40:30.420Z] mkdir -p "/home/jenkins/workspace/Test_openjdk11_hs_extended.openjdk_x86-64_linux_testList_1/aqa-tests/TKG/../TKG/output_17540830706335/jdk_jfr_0"; \
[2025-08-02T05:40:30.420Z] cd "/home/jenkins/workspace/Test_openjdk11_hs_extended.openjdk_x86-64_linux_testList_1/aqa-tests/TKG/../TKG/output_17540830706335/jdk_jfr_0"; \
[2025-08-02T05:40:30.420Z] echo ""; echo "TESTING:"; \
[2025-08-02T05:40:30.420Z] "/home/jenkins/workspace/Test_openjdk11_hs_extended.openjdk_x86-64_linux_testList_1/jdkbinary/j2sdk-image/bin/java" -Xmx512m -jar "/home/jenkins/workspace/Test_openjdk11_hs_extended.openjdk_x86-64_linux_testList_1/aqa-tests/TKG/../../jvmtest/openjdk/jtreg/lib/jtreg.jar" \
[2025-08-02T05:40:30.420Z] -agentvm -a -ea -esa -v:fail,error,time,nopass -retain:fail,error,*.dmp,javacore.*,heapdump.*,*.trc -ignore:quiet -timeoutFactor:8 -xml:verify -concurrency:3 -nativepath:"/home/jenkins/workspace/Test_openjdk11_hs_extended.openjdk_x86-64_linux_testList_1/jdkbinary/openjdk-test-image/jdk/jtreg/native" -vmoptions:"-Xmx768m -XX:+UseCompressedOops " \
[2025-08-02T05:40:30.420Z] -w ""/home/jenkins/workspace/Test_openjdk11_hs_extended.openjdk_x86-64_linux_testList_1/aqa-tests/TKG/../TKG/output_17540830706335/jdk_jfr_0"/work" \
[2025-08-02T05:40:30.420Z] -r ""/home/jenkins/workspace/Test_openjdk11_hs_extended.openjdk_x86-64_linux_testList_1/aqa-tests/TKG/../TKG/output_17540830706335/jdk_jfr_0"/report" \
[2025-08-02T05:40:30.420Z] -jdk:"/home/jenkins/workspace/Test_openjdk11_hs_extended.openjdk_x86-64_linux_testList_1/jdkbinary/j2sdk-image" \
[2025-08-02T05:40:30.420Z] -exclude:"/home/jenkins/workspace/Test_openjdk11_hs_extended.openjdk_x86-64_linux_testList_1/aqa-tests/TKG/../openjdk/openjdk-jdk/test/jdk/ProblemList.txt" \
[2025-08-02T05:40:30.420Z] -exclude:"/home/jenkins/workspace/Test_openjdk11_hs_extended.openjdk_x86-64_linux_testList_1/aqa-tests/TKG/../../jvmtest/openjdk/excludes/ProblemList_openjdk11.txt" \
[2025-08-02T05:40:30.420Z] \
[2025-08-02T05:40:30.420Z] -exclude:"/home/jenkins/workspace/Test_openjdk11_hs_extended.openjdk_x86-64_linux_testList_1/aqa-tests/TKG/../openjdk/excludes/vendors/eclipse/ProblemList_openjdk11.txt" \
[2025-08-02T05:40:30.420Z] "/home/jenkins/workspace/Test_openjdk11_hs_extended.openjdk_x86-64_linux_testList_1/aqa-tests/TKG/../openjdk/openjdk-jdk/test/jdk:jdk_jfr"; \
[2025-08-02T05:40:30.420Z] if [ $? -eq 0 ]; then echo "-----------------------------------"; echo "jdk_jfr_0""_PASSED"; echo "-----------------------------------"; cd /home/jenkins/workspace/Test_openjdk11_hs_extended.openjdk_x86-64_linux_testList_1/aqa-tests/TKG/..; else echo "-----------------------------------"; echo "jdk_jfr_0""_FAILED"; echo "-----------------------------------"; fi; \
[2025-08-02T05:40:30.420Z] echo ""; echo "TEST TEARDOWN:"; \
[2025-08-02T05:40:30.420Z] echo "Nothing to be done for teardown."; \
[2025-08-02T05:40:30.420Z] } 2>&1 | tee -a "/home/jenkins/workspace/Test_openjdk11_hs_extended.openjdk_x86-64_linux_testList_1/aqa-tests/TKG/../TKG/output_17540830706335/TestTargetResult";
[2025-08-02T05:40:30.420Z]
[2025-08-02T05:40:30.420Z] TEST SETUP:
[2025-08-02T05:40:30.420Z] Nothing to be done for setup.
[2025-08-02T05:40:30.420Z]
[2025-08-02T05:40:30.420Z] TESTING:
[2025-08-02T05:40:30.420Z] Directory "/home/jenkins/workspace/Test_openjdk11_hs_extended.openjdk_x86-64_linux_testList_1/aqa-tests/TKG/../TKG/output_17540830706335/jdk_jfr_0/work" not found: creating
[2025-08-02T05:40:30.420Z] Directory "/home/jenkins/workspace/Test_openjdk11_hs_extended.openjdk_x86-64_linux_testList_1/aqa-tests/TKG/../TKG/output_17540830706335/jdk_jfr_0/report" not found: creating
[2025-08-02T05:40:52.884Z] XML output with verification to /home/jenkins/workspace/Test_openjdk11_hs_extended.openjdk_x86-64_linux_testList_1/aqa-tests/TKG/output_17540830706335/jdk_jfr_0/work
[2025-08-02T06:08:38.966Z] --------------------------------------------------
[2025-08-02T06:08:38.966Z] TEST: jdk/jfr/event/runtime/TestThreadCpuTimeEvent.java
[2025-08-02T06:08:38.966Z] TEST JDK: /home/jenkins/workspace/Test_openjdk11_hs_extended.openjdk_x86-64_linux_testList_1/jdkbinary/j2sdk-image
[2025-08-02T06:08:38.966Z]
[2025-08-02T06:08:38.966Z] ACTION: build -- Passed. Build successful
[2025-08-02T06:08:38.966Z] REASON: Named class compiled on demand
[2025-08-02T06:08:38.966Z] TIME: 1.803 seconds
[2025-08-02T06:08:38.966Z] messages:
[2025-08-02T06:08:38.966Z] command: build jdk.jfr.event.runtime.TestThreadCpuTimeEvent
[2025-08-02T06:08:38.966Z] reason: Named class compiled on demand
[2025-08-02T06:08:38.966Z] started: Sat Aug 02 06:08:11 UTC 2025
[2025-08-02T06:08:38.966Z] Test directory:
[2025-08-02T06:08:38.966Z] compile: jdk.jfr.event.runtime.TestThreadCpuTimeEvent
[2025-08-02T06:08:38.966Z] finished: Sat Aug 02 06:08:13 UTC 2025
[2025-08-02T06:08:38.966Z] elapsed time (seconds): 1.803
[2025-08-02T06:08:38.966Z]
[2025-08-02T06:08:38.966Z] ACTION: compile -- Passed. Compilation successful
[2025-08-02T06:08:38.966Z] REASON: .class file out of date or does not exist
[2025-08-02T06:08:38.966Z] TIME: 1.767 seconds
[2025-08-02T06:08:38.966Z] messages:
[2025-08-02T06:08:38.966Z] command: compile /home/jenkins/workspace/Test_openjdk11_hs_extended.openjdk_x86-64_linux_testList_1/aqa-tests/openjdk/openjdk-jdk/test/jdk/jdk/jfr/event/runtime/TestThreadCpuTimeEvent.java
[2025-08-02T06:08:38.966Z] reason: .class file out of date or does not exist
[2025-08-02T06:08:38.966Z] started: Sat Aug 02 06:08:11 UTC 2025
[2025-08-02T06:08:38.966Z] Additional options from @modules: --add-modules jdk.jfr,jdk.management
[2025-08-02T06:08:38.966Z] Mode: agentvm
[2025-08-02T06:08:38.966Z] Agent id: 1
[2025-08-02T06:08:38.966Z] finished: Sat Aug 02 06:08:13 UTC 2025
[2025-08-02T06:08:38.966Z] elapsed time (seconds): 1.767
[2025-08-02T06:08:38.966Z] configuration:
[2025-08-02T06:08:38.966Z] Boot Layer (javac runtime environment)
[2025-08-02T06:08:38.966Z] class path: /home/jenkins/workspace/Test_openjdk11_hs_extended.openjdk_x86-64_linux_testList_1/jvmtest/openjdk/jtreg/lib/javatest.jar
[2025-08-02T06:08:38.966Z] /home/jenkins/workspace/Test_openjdk11_hs_extended.openjdk_x86-64_linux_testList_1/jvmtest/openjdk/jtreg/lib/jtreg.jar
[2025-08-02T06:08:38.966Z] patch: java.base /home/jenkins/workspace/Test_openjdk11_hs_extended.openjdk_x86-64_linux_testList_1/aqa-tests/TKG/output_17540830706335/jdk_jfr_0/work/patches/java.base
[2025-08-02T06:08:38.966Z]
[2025-08-02T06:08:38.966Z] javac compilation environment
[2025-08-02T06:08:38.966Z] add modules: jdk.jfr jdk.management
[2025-08-02T06:08:38.966Z] source path: /home/jenkins/workspace/Test_openjdk11_hs_extended.openjdk_x86-64_linux_testList_1/aqa-tests/openjdk/openjdk-jdk/test/jdk/jdk/jfr/event/runtime
[2025-08-02T06:08:38.966Z] /home/jenkins/workspace/Test_openjdk11_hs_extended.openjdk_x86-64_linux_testList_1/aqa-tests/openjdk/openjdk-jdk/test/lib
[2025-08-02T06:08:38.966Z] class path: /home/jenkins/workspace/Test_openjdk11_hs_extended.openjdk_x86-64_linux_testList_1/aqa-tests/openjdk/openjdk-jdk/test/jdk/jdk/jfr/event/runtime
[2025-08-02T06:08:38.966Z] /home/jenkins/workspace/Test_openjdk11_hs_extended.openjdk_x86-64_linux_testList_1/aqa-tests/TKG/output_17540830706335/jdk_jfr_0/work/classes/0/jdk/jfr/event/runtime/TestThreadCpuTimeEvent.d
[2025-08-02T06:08:38.966Z] /home/jenkins/workspace/Test_openjdk11_hs_extended.openjdk_x86-64_linux_testList_1/aqa-tests/TKG/output_17540830706335/jdk_jfr_0/work/classes/0/test/lib
[2025-08-02T06:08:38.966Z]
[2025-08-02T06:08:38.966Z] rerun:
[2025-08-02T06:08:38.967Z] cd /home/jenkins/workspace/Test_openjdk11_hs_extended.openjdk_x86-64_linux_testList_1/aqa-tests/TKG/output_17540830706335/jdk_jfr_0/work/scratch/2 && \
[2025-08-02T06:08:38.967Z] DISPLAY=:0 \
[2025-08-02T06:08:38.967Z] HOME=/home/jenkins \
[2025-08-02T06:08:38.967Z] LANG=C.UTF-8 \
[2025-08-02T06:08:38.967Z] PATH=/bin:/usr/bin:/usr/sbin \
[2025-08-02T06:08:38.967Z] /home/jenkins/workspace/Test_openjdk11_hs_extended.openjdk_x86-64_linux_testList_1/jdkbinary/j2sdk-image/bin/javac \
[2025-08-02T06:08:38.967Z] -J-ea \
[2025-08-02T06:08:38.967Z] -J-esa \
[2025-08-02T06:08:38.967Z] -J-Xmx768m \
[2025-08-02T06:08:38.967Z] -J-XX:+UseCompressedOops \
[2025-08-02T06:08:38.967Z] -J-Dtest.vm.opts='-ea -esa -Xmx768m -XX:+UseCompressedOops' \
[2025-08-02T06:08:38.967Z] -J-Dtest.tool.vm.opts='-J-ea -J-esa -J-Xmx768m -J-XX:+UseCompressedOops' \
[2025-08-02T06:08:38.967Z] -J-Dtest.compiler.opts= \
[2025-08-02T06:08:38.967Z] -J-Dtest.java.opts= \
[2025-08-02T06:08:38.967Z] -J-Dtest.jdk=/home/jenkins/workspace/Test_openjdk11_hs_extended.openjdk_x86-64_linux_testList_1/jdkbinary/j2sdk-image \
[2025-08-02T06:08:38.967Z] -J-Dcompile.jdk=/home/jenkins/workspace/Test_openjdk11_hs_extended.openjdk_x86-64_linux_testList_1/jdkbinary/j2sdk-image \
[2025-08-02T06:08:38.967Z] -J-Dtest.timeout.factor=8.0 \
[2025-08-02T06:08:38.967Z] -J-Dtest.nativepath=/home/jenkins/workspace/Test_openjdk11_hs_extended.openjdk_x86-64_linux_testList_1/jdkbinary/openjdk-test-image/jdk/jtreg/native \
[2025-08-02T06:08:38.967Z] -J-Dtest.root=/home/jenkins/workspace/Test_openjdk11_hs_extended.openjdk_x86-64_linux_testList_1/aqa-tests/openjdk/openjdk-jdk/test/jdk \
[2025-08-02T06:08:38.967Z] -J-Dtest.name=jdk/jfr/event/runtime/TestThreadCpuTimeEvent.java \
[2025-08-02T06:08:38.967Z] -J-Dtest.file=/home/jenkins/workspace/Test_openjdk11_hs_extended.openjdk_x86-64_linux_testList_1/aqa-tests/openjdk/openjdk-jdk/test/jdk/jdk/jfr/event/runtime/TestThreadCpuTimeEvent.java \
[2025-08-02T06:08:38.967Z] -J-Dtest.src=/home/jenkins/workspace/Test_openjdk11_hs_extended.openjdk_x86-64_linux_testList_1/aqa-tests/openjdk/openjdk-jdk/test/jdk/jdk/jfr/event/runtime \
[2025-08-02T06:08:38.967Z] -J-Dtest.src.path=/home/jenkins/workspace/Test_openjdk11_hs_extended.openjdk_x86-64_linux_testList_1/aqa-tests/openjdk/openjdk-jdk/test/jdk/jdk/jfr/event/runtime:/home/jenkins/workspace/Test_openjdk11_hs_extended.openjdk_x86-64_linux_testList_1/aqa-tests/openjdk/openjdk-jdk/test/lib \
[2025-08-02T06:08:38.967Z] -J-Dtest.classes=/home/jenkins/workspace/Test_openjdk11_hs_extended.openjdk_x86-64_linux_testList_1/aqa-tests/TKG/output_17540830706335/jdk_jfr_0/work/classes/0/jdk/jfr/event/runtime/TestThreadCpuTimeEvent.d \
[2025-08-02T06:08:38.967Z] -J-Dtest.class.path=/home/jenkins/workspace/Test_openjdk11_hs_extended.openjdk_x86-64_linux_testList_1/aqa-tests/TKG/output_17540830706335/jdk_jfr_0/work/classes/0/jdk/jfr/event/runtime/TestThreadCpuTimeEvent.d:/home/jenkins/workspace/Test_openjdk11_hs_extended.openjdk_x86-64_linux_testList_1/aqa-tests/TKG/output_17540830706335/jdk_jfr_0/work/classes/0/test/lib \
[2025-08-02T06:08:38.967Z] -J-Dtest.class.path.prefix=/home/jenkins/workspace/Test_openjdk11_hs_extended.openjdk_x86-64_linux_testList_1/aqa-tests/TKG/output_17540830706335/jdk_jfr_0/work/classes/0/jdk/jfr/event/runtime/TestThreadCpuTimeEvent.d:/home/jenkins/workspace/Test_openjdk11_hs_extended.openjdk_x86-64_linux_testList_1/aqa-tests/openjdk/openjdk-jdk/test/jdk/jdk/jfr/event/runtime:/home/jenkins/workspace/Test_openjdk11_hs_extended.openjdk_x86-64_linux_testList_1/aqa-tests/TKG/output_17540830706335/jdk_jfr_0/work/classes/0/test/lib \
[2025-08-02T06:08:38.967Z] -J-Dtest.modules='jdk.jfr jdk.management' \
[2025-08-02T06:08:38.967Z] --add-modules jdk.jfr,jdk.management \
[2025-08-02T06:08:38.967Z] -d /home/jenkins/workspace/Test_openjdk11_hs_extended.openjdk_x86-64_linux_testList_1/aqa-tests/TKG/output_17540830706335/jdk_jfr_0/work/classes/0/jdk/jfr/event/runtime/TestThreadCpuTimeEvent.d \
[2025-08-02T06:08:38.967Z] -sourcepath /home/jenkins/workspace/Test_openjdk11_hs_extended.openjdk_x86-64_linux_testList_1/aqa-tests/openjdk/openjdk-jdk/test/jdk/jdk/jfr/event/runtime:/home/jenkins/workspace/Test_openjdk11_hs_extended.openjdk_x86-64_linux_testList_1/aqa-tests/openjdk/openjdk-jdk/test/lib \
[2025-08-02T06:08:38.967Z] -classpath /home/jenkins/workspace/Test_openjdk11_hs_extended.openjdk_x86-64_linux_testList_1/aqa-tests/openjdk/openjdk-jdk/test/jdk/jdk/jfr/event/runtime:/home/jenkins/workspace/Test_openjdk11_hs_extended.openjdk_x86-64_linux_testList_1/aqa-tests/TKG/output_17540830706335/jdk_jfr_0/work/classes/0/jdk/jfr/event/runtime/TestThreadCpuTimeEvent.d:/home/jenkins/workspace/Test_openjdk11_hs_extended.openjdk_x86-64_linux_testList_1/aqa-tests/TKG/output_17540830706335/jdk_jfr_0/work/classes/0/test/lib /home/jenkins/workspace/Test_openjdk11_hs_extended.openjdk_x86-64_linux_testList_1/aqa-tests/openjdk/openjdk-jdk/test/jdk/jdk/jfr/event/runtime/TestThreadCpuTimeEvent.java
[2025-08-02T06:08:38.967Z]
[2025-08-02T06:08:38.967Z] ACTION: main -- Failed. Execution failed: `main' threw exception: java.lang.RuntimeException: assertLessThan: expected that PT0.145S < PT0.1383831S
[2025-08-02T06:08:38.967Z] REASON: User specified action: run main/othervm jdk.jfr.event.runtime.TestThreadCpuTimeEvent
[2025-08-02T06:08:38.967Z] TIME: 18.3 seconds
[2025-08-02T06:08:38.967Z] messages:
[2025-08-02T06:08:38.967Z] command: main jdk.jfr.event.runtime.TestThreadCpuTimeEvent
[2025-08-02T06:08:38.967Z] reason: User specified action: run main/othervm jdk.jfr.event.runtime.TestThreadCpuTimeEvent
[2025-08-02T06:08:38.967Z] started: Sat Aug 02 06:08:13 UTC 2025
[2025-08-02T06:08:38.967Z] Mode: othervm [/othervm specified]
[2025-08-02T06:08:38.967Z] Additional options from @modules: --add-modules jdk.jfr,jdk.management
[2025-08-02T06:08:38.967Z] finished: Sat Aug 02 06:08:31 UTC 2025
[2025-08-02T06:08:38.967Z] elapsed time (seconds): 18.3
[2025-08-02T06:08:38.967Z] configuration:
[2025-08-02T06:08:38.967Z] Boot Layer
[2025-08-02T06:08:38.967Z] add modules: jdk.jfr jdk.management
[2025-08-02T06:08:38.967Z]
[2025-08-02T06:08:38.967Z] STDOUT:
[2025-08-02T06:08:38.967Z] STDERR:
[2025-08-02T06:08:38.967Z] java.lang.RuntimeException: assertLessThan: expected that PT0.145S < PT0.1383831S
[2025-08-02T06:08:38.967Z] at jdk.test.lib.Asserts.fail(Asserts.java:594)
[2025-08-02T06:08:38.967Z] at jdk.test.lib.Asserts.assertLessThan(Asserts.java:99)
[2025-08-02T06:08:38.967Z] at jdk.test.lib.Asserts.assertLessThan(Asserts.java:82)
[2025-08-02T06:08:38.967Z] at jdk.jfr.event.runtime.TestThreadCpuTimeEvent.testCompareWithMXBean(TestThreadCpuTimeEvent.java:237)
[2025-08-02T06:08:38.967Z] at jdk.jfr.event.runtime.TestThreadCpuTimeEvent.main(TestThreadCpuTimeEvent.java:63)
[2025-08-02T06:08:38.967Z] at java.base/jdk.internal.reflect.NativeMethodAccessorImpl.invoke0(Native Method)
[2025-08-02T06:08:38.967Z] at java.base/jdk.internal.reflect.NativeMethodAccessorImpl.invoke(NativeMethodAccessorImpl.java:62)
[2025-08-02T06:08:38.967Z] at java.base/jdk.internal.reflect.DelegatingMethodAccessorImpl.invoke(DelegatingMethodAccessorImpl.java:43)
[2025-08-02T06:08:38.967Z] at java.base/java.lang.reflect.Method.invoke(Method.java:566)
[2025-08-02T06:08:38.967Z] at com.sun.javatest.regtest.agent.MainWrapper$MainTask.run(MainWrapper.java:138)
[2025-08-02T06:08:38.967Z] at java.base/java.lang.Thread.run(Thread.java:829)
[2025-08-02T06:08:38.967Z]
[2025-08-02T06:08:38.967Z] JavaTest Message: Test threw exception: java.lang.RuntimeException: assertLessThan: expected that PT0.145S < PT0.1383831S
[2025-08-02T06:08:38.967Z] JavaTest Message: shutting down test
[2025-08-02T06:08:38.967Z]
[2025-08-02T06:08:38.967Z] STATUS:Failed.`main' threw exception: java.lang.RuntimeException: assertLessThan: expected that PT0.145S < PT0.1383831S
[2025-08-02T06:08:38.967Z] rerun:
[2025-08-02T06:08:38.968Z] cd /home/jenkins/workspace/Test_openjdk11_hs_extended.openjdk_x86-64_linux_testList_1/aqa-tests/TKG/output_17540830706335/jdk_jfr_0/work/scratch/2 && \
[2025-08-02T06:08:38.968Z] DISPLAY=:0 \
[2025-08-02T06:08:38.968Z] HOME=/home/jenkins \
[2025-08-02T06:08:38.968Z] LANG=C.UTF-8 \
[2025-08-02T06:08:38.968Z] PATH=/bin:/usr/bin:/usr/sbin \
[2025-08-02T06:08:38.968Z] CLASSPATH=/home/jenkins/workspace/Test_openjdk11_hs_extended.openjdk_x86-64_linux_testList_1/aqa-tests/TKG/output_17540830706335/jdk_jfr_0/work/classes/0/jdk/jfr/event/runtime/TestThreadCpuTimeEvent.d:/home/jenkins/workspace/Test_openjdk11_hs_extended.openjdk_x86-64_linux_testList_1/aqa-tests/openjdk/openjdk-jdk/test/jdk/jdk/jfr/event/runtime:/home/jenkins/workspace/Test_openjdk11_hs_extended.openjdk_x86-64_linux_testList_1/aqa-tests/TKG/output_17540830706335/jdk_jfr_0/work/classes/0/test/lib:/home/jenkins/workspace/Test_openjdk11_hs_extended.openjdk_x86-64_linux_testList_1/aqa-tests/openjdk/openjdk-jdk/test/lib:/home/jenkins/workspace/Test_openjdk11_hs_extended.openjdk_x86-64_linux_testList_1/jvmtest/openjdk/jtreg/lib/javatest.jar:/home/jenkins/workspace/Test_openjdk11_hs_extended.openjdk_x86-64_linux_testList_1/jvmtest/openjdk/jtreg/lib/jtreg.jar \
[2025-08-02T06:08:38.968Z] /home/jenkins/workspace/Test_openjdk11_hs_extended.openjdk_x86-64_linux_testList_1/jdkbinary/j2sdk-image/bin/java \
[2025-08-02T06:08:38.968Z] -Dtest.vm.opts='-ea -esa -Xmx768m -XX:+UseCompressedOops' \
[2025-08-02T06:08:38.968Z] -Dtest.tool.vm.opts='-J-ea -J-esa -J-Xmx768m -J-XX:+UseCompressedOops' \
[2025-08-02T06:08:38.968Z] -Dtest.compiler.opts= \
[2025-08-02T06:08:38.968Z] -Dtest.java.opts= \
[2025-08-02T06:08:38.968Z] -Dtest.jdk=/home/jenkins/workspace/Test_openjdk11_hs_extended.openjdk_x86-64_linux_testList_1/jdkbinary/j2sdk-image \
[2025-08-02T06:08:38.968Z] -Dcompile.jdk=/home/jenkins/workspace/Test_openjdk11_hs_extended.openjdk_x86-64_linux_testList_1/jdkbinary/j2sdk-image \
[2025-08-02T06:08:38.968Z] -Dtest.timeout.factor=8.0 \
[2025-08-02T06:08:38.968Z] -Dtest.nativepath=/home/jenkins/workspace/Test_openjdk11_hs_extended.openjdk_x86-64_linux_testList_1/jdkbinary/openjdk-test-image/jdk/jtreg/native \
[2025-08-02T06:08:38.968Z] -Dtest.root=/home/jenkins/workspace/Test_openjdk11_hs_extended.openjdk_x86-64_linux_testList_1/aqa-tests/openjdk/openjdk-jdk/test/jdk \
[2025-08-02T06:08:38.968Z] -Dtest.name=jdk/jfr/event/runtime/TestThreadCpuTimeEvent.java \
[2025-08-02T06:08:38.968Z] -Dtest.file=/home/jenkins/workspace/Test_openjdk11_hs_extended.openjdk_x86-64_linux_testList_1/aqa-tests/openjdk/openjdk-jdk/test/jdk/jdk/jfr/event/runtime/TestThreadCpuTimeEvent.java \
[2025-08-02T06:08:38.968Z] -Dtest.src=/home/jenkins/workspace/Test_openjdk11_hs_extended.openjdk_x86-64_linux_testList_1/aqa-tests/openjdk/openjdk-jdk/test/jdk/jdk/jfr/event/runtime \
[2025-08-02T06:08:38.968Z] -Dtest.src.path=/home/jenkins/workspace/Test_openjdk11_hs_extended.openjdk_x86-64_linux_testList_1/aqa-tests/openjdk/openjdk-jdk/test/jdk/jdk/jfr/event/runtime:/home/jenkins/workspace/Test_openjdk11_hs_extended.openjdk_x86-64_linux_testList_1/aqa-tests/openjdk/openjdk-jdk/test/lib \
[2025-08-02T06:08:38.968Z] -Dtest.classes=/home/jenkins/workspace/Test_openjdk11_hs_extended.openjdk_x86-64_linux_testList_1/aqa-tests/TKG/output_17540830706335/jdk_jfr_0/work/classes/0/jdk/jfr/event/runtime/TestThreadCpuTimeEvent.d \
[2025-08-02T06:08:38.968Z] -Dtest.class.path=/home/jenkins/workspace/Test_openjdk11_hs_extended.openjdk_x86-64_linux_testList_1/aqa-tests/TKG/output_17540830706335/jdk_jfr_0/work/classes/0/jdk/jfr/event/runtime/TestThreadCpuTimeEvent.d:/home/jenkins/workspace/Test_openjdk11_hs_extended.openjdk_x86-64_linux_testList_1/aqa-tests/TKG/output_17540830706335/jdk_jfr_0/work/classes/0/test/lib \
[2025-08-02T06:08:38.968Z] -Dtest.class.path.prefix=/home/jenkins/workspace/Test_openjdk11_hs_extended.openjdk_x86-64_linux_testList_1/aqa-tests/TKG/output_17540830706335/jdk_jfr_0/work/classes/0/jdk/jfr/event/runtime/TestThreadCpuTimeEvent.d:/home/jenkins/workspace/Test_openjdk11_hs_extended.openjdk_x86-64_linux_testList_1/aqa-tests/openjdk/openjdk-jdk/test/jdk/jdk/jfr/event/runtime:/home/jenkins/workspace/Test_openjdk11_hs_extended.openjdk_x86-64_linux_testList_1/aqa-tests/TKG/output_17540830706335/jdk_jfr_0/work/classes/0/test/lib \
[2025-08-02T06:08:38.968Z] -Dtest.modules='jdk.jfr jdk.management' \
[2025-08-02T06:08:38.968Z] --add-modules jdk.jfr,jdk.management \
[2025-08-02T06:08:38.968Z] -ea \
[2025-08-02T06:08:38.968Z] -esa \
[2025-08-02T06:08:38.968Z] -Xmx768m \
[2025-08-02T06:08:38.968Z] -XX:+UseCompressedOops \
[2025-08-02T06:08:38.968Z] -Djava.library.path=/home/jenkins/workspace/Test_openjdk11_hs_extended.openjdk_x86-64_linux_testList_1/jdkbinary/openjdk-test-image/jdk/jtreg/native \
[2025-08-02T06:08:38.968Z] com.sun.javatest.regtest.agent.MainWrapper /home/jenkins/workspace/Test_openjdk11_hs_extended.openjdk_x86-64_linux_testList_1/aqa-tests/TKG/output_17540830706335/jdk_jfr_0/work/jdk/jfr/event/runtime/TestThreadCpuTimeEvent.d/main.0.jta
[2025-08-02T06:08:38.968Z]
[2025-08-02T06:08:38.968Z] TEST RESULT: Failed. Execution failed: `main' threw exception: java.lang.RuntimeException: assertLessThan: expected that PT0.145S < PT0.1383831S
[2025-08-02T06:08:38.968Z] --------------------------------------------------
[2025-08-02T06:23:42.572Z] Test results: passed: 435; failed: 1
[2025-08-02T06:24:01.408Z] Report written to /home/jenkins/workspace/Test_openjdk11_hs_extended.openjdk_x86-64_linux_testList_1/aqa-tests/TKG/output_17540830706335/jdk_jfr_0/report/html/report.html
[2025-08-02T06:24:01.408Z] Results written to /home/jenkins/workspace/Test_openjdk11_hs_extended.openjdk_x86-64_linux_testList_1/aqa-tests/TKG/output_17540830706335/jdk_jfr_0/work
[2025-08-02T06:24:01.408Z] Error: Some tests failed or other problems occurred.
[2025-08-02T06:24:01.408Z] -----------------------------------
[2025-08-02T06:24:01.408Z] jdk_jfr_0_FAILED
[2025-08-02T06:24:01.408Z] -----------------------------------
[2025-08-02T06:24:01.408Z]
[2025-08-02T06:24:01.408Z] TEST TEARDOWN:
[2025-08-02T06:24:01.408Z] Nothing to be done for teardown.
[2025-08-02T06:24:01.408Z] jdk_jfr_0 Finish Time: Sat Aug 2 06:23:59 2025 Epoch Time (ms): 1754115839186